program: Orca
programVersion: 5.0.2
elementType: Cl Cl F O O O N C C C C C C C C C C C C C C C C C C C C C C H H H H H H H H H H H H H H H H H H
charge: 0
multiplicity: 1
keywords: wb97x-d3
keywords: def2-TZVPP
keywords: def2/J RIJCOSX
keywords: DEFGRID2
keywords: scfconv7
keywords: smallprint printgap noloewdin
keywords: NOSOSCF
formula: C22H18Cl2FNO3
InChI: InChI=1/C22H18Cl2FNO3/c1-22(2)15(11-19(23)24)20(22)21(27)29-18(12-26)13-8-9-16(25)17(10-13)28-14-6-4-3-5-7-14/h3-11,15,18,20H,1-2H3
47 atoms
Cl -2.295121 -0.454733 2.176104
Cl -4.637866 -1.145286 0.643899
F  4.203712 -3.068546 -0.4936
O  0.921599 2.248712 0.102436
O  1.121718 1.934502 -2.098577
O  1.65427 -2.708614 0.246381
N  2.834919 3.003197 2.671674
C  -1.939464 3.175661 -0.596498
C  -1.910055 1.823381 0.050406
C  -1.053034 2.090162 -1.178203
C  -1.350482 4.338166 0.165609
C  -3.113721 3.580217 -1.455609
C  -3.02542 0.874219 -0.053869
C  0.419938 2.085167 -1.132015
C  -3.272648 -0.108841 0.802895
C  2.327004 2.159293 0.251426
C  2.84219 0.746442 0.076868
C  2.593111 2.634039 1.611812
C  2.003611 -0.331065 0.314194
C  4.153864 0.536426 -0.324807
C  2.453666 -1.621603 0.087923
C  4.628569 -0.755405 -0.490724
C  3.771723 -1.819413 -0.298304
C  0.397704 -2.684495 -0.309211
C  0.113914 -2.002022 -1.486413
C  -0.587073 -3.409308 0.345266
C  -1.175343 -2.047524 -1.998192
C  -1.868801 -3.450021 -0.183534
C  -2.171229 -2.766663 -1.353154
H  -1.363872 1.786431 0.985188
H  -1.414409 1.672002 -2.110901
H  -0.60391 4.045563 0.90026
H  -0.894202 5.059147 -0.515351
H  -2.145876 4.855878 0.704855
H  -2.83122 4.409446 -2.106457
H  -3.474911 2.777828 -2.097593
H  -3.946504 3.915778 -0.834626
H  -3.709782 0.9749 -0.887573
H  2.845466 2.833014 -0.439862
H  0.984413 -0.184652 0.65056
H  4.810334 1.375878 -0.515057
H  5.649727 -0.935274 -0.800614
H  0.876462 -1.437697 -2.008262
H  -0.351882 -3.933667 1.263068
H  -1.396374 -1.513551 -2.913599
H  -2.636108 -4.013393 0.331086
H  -3.17395 -2.792534 -1.757491
elementType: Cl F O N C H
totalener: -2149.93512807 hartree
nucrepener: 3162.34676365 hartree
electener: -5312.28189173 hartree
oneelecener: -9237.79684067 hartree
twoeener: 3925.51494894 hartree
cpcmener: -0.03324602 hartree
kineticenergy: 2143.46733244 hartree
xcener: -159.165902801098 hartree
chargesum: -0.0000000
charge: -0.060290 -0.064689 -0.207588 -0.279518 -0.427342 -0.328314 -0.083049 0.086599 0.068533 -0.077449 -0.260795 -0.285131 -0.254575 0.380204 0.083576 0.368228 0.018939 -0.230907 -0.154637 -0.193612 0.181841 -0.157057 0.201752 0.296604 -0.169389 -0.253283 -0.176538 -0.123229 -0.165271 0.089526 0.103820 0.093708 0.102118 0.097420 0.100380 0.093562 0.104805 0.128480 0.149684 0.140857 0.147885 0.151810 0.151720 0.144916 0.158454 0.152677 0.154566
qa: -0.0603 -0.0647 -0.2076 -0.2795 -0.4273 -0.3283 -0.0830 0.0866 0.0685 -0.0774 -0.2608 -0.2851 -0.2546 0.3802 0.0836 0.3682 0.0189 -0.2309 -0.1546 -0.1936 0.1818 -0.1571 0.2018 0.2966 -0.1694 -0.2533 -0.1765 -0.1232 -0.1653 0.0895 0.1038 0.0937 0.1021 0.0974 0.1004 0.0936 0.1048 0.1285 0.1497 0.1409 0.1479 0.1518 0.1517 0.1449 0.1585 0.1527 0.1546
va: 1.2621 1.2368 1.0862 2.1072 2.0752 2.0921 3.1102 3.8133 3.7668 3.8192 3.9089 3.9176 3.9125 4.1688 4.1759 3.7406 3.6365 4.0655 3.9382 3.9593 3.7192 3.8707 4.0728 3.6645 3.8329 3.9820 3.8731 3.8326 3.8146 1.0393 1.0239 1.0107 0.9998 1.0005 1.0006 1.0051 0.9994 1.0233 1.0130 1.0103 1.0001 0.9968 1.0041 1.0072 0.9925 0.9953 0.9969
dispcorr: -0.031084421 hartree
energy: -2149.966212494961
dipole: -5.61462 4.42453 -1.19009 22.56332 -21.19438 1.36894 -14.79669 13.21577 -1.58093
magnitude: 2.40617 au
magnitude: 6.11599 debye
