program: Orca
programVersion: 5.0.2
elementType: Cl Cl F O O O N C C C C C C C C C C C C C C C C C C C C C C H H H H H H H H H H H H H H H H H H
charge: 0
multiplicity: 1
keywords: wb97x-d3
keywords: def2-TZVPP
keywords: def2/J RIJCOSX
keywords: DEFGRID2
keywords: scfconv7
keywords: smallprint printgap noloewdin
keywords: NOSOSCF
formula: C22H18Cl2FNO3
InChI: InChI=1/C22H18Cl2FNO3/c1-22(2)15(11-19(23)24)20(22)21(27)29-18(12-26)13-8-9-16(25)17(10-13)28-14-6-4-3-5-7-14/h3-11,15,18,20H,1-2H3
47 atoms
Cl -2.055139 0.586234 -1.852123
Cl -4.419904 1.812654 -2.975544
F  1.80162 -3.281872 -2.006258
O  1.230471 2.636412 0.036297
O  0.170859 1.38081 1.545647
O  3.040123 -3.019142 0.409985
N  3.329869 1.945838 2.62492
C  -2.016959 3.660935 1.314979
C  -2.414133 2.478951 0.504905
C  -1.026436 3.063816 0.322786
C  -1.820242 3.483821 2.799494
C  -2.540776 5.025073 0.938432
C  -3.373434 2.55769 -0.617953
C  0.135548 2.262292 0.726789
C  -3.29731 1.761337 -1.675193
C  2.397646 1.847974 0.184019
C  2.221924 0.445277 -0.359227
C  2.889734 1.885648 1.565775
C  2.658738 -0.676675 0.330586
C  1.632172 0.299131 -1.609956
C  2.528097 -1.934488 -0.232996
C  1.47486 -0.959106 -2.168542
C  1.929872 -2.061853 -1.47806
C  2.195187 -3.981019 0.896487
C  0.840059 -3.767715 1.107735
C  2.779799 -5.201771 1.210042
C  0.068346 -4.79948 1.627856
C  1.9962 -6.217956 1.732595
C  0.636083 -6.025333 1.940919
H  -2.428636 1.534049 1.042877
H  -0.872024 3.656406 -0.571599
H  -1.540927 2.47016 3.078139
H  -1.05344 4.16287 3.176762
H  -2.751569 3.718302 3.318675
H  -2.632094 5.160522 -0.139845
H  -3.524086 5.195228 1.381653
H  -1.871979 5.803157 1.310761
H  -4.185113 3.275055 -0.574362
H  3.148444 2.368587 -0.416865
H  3.116986 -0.599336 1.309161
H  1.292804 1.162695 -2.166574
H  1.014522 -1.080768 -3.140544
H  0.377577 -2.81416 0.884707
H  3.839505 -5.350915 1.043556
H  -0.988681 -4.633054 1.791374
H  2.454252 -7.168585 1.974103
H  0.026863 -6.822718 2.34544
elementType: Cl F O N C H
totalener: -2149.93553451 hartree
nucrepener: 3011.29493141 hartree
electener: -5161.23046592 hartree
oneelecener: -8936.55727070 hartree
twoeener: 3775.32680478 hartree
cpcmener: -0.03314992 hartree
kineticenergy: 2143.47574185 hartree
xcener: -159.163309552924 hartree
chargesum: -0.0000000
charge: -0.054530 -0.053900 -0.207872 -0.287936 -0.437145 -0.321152 -0.077572 0.131788 -0.057442 -0.094978 -0.266327 -0.280818 -0.203434 0.387103 0.073010 0.522986 -0.056593 -0.263445 -0.140644 -0.256965 0.132976 -0.151444 0.272576 0.286966 -0.176280 -0.247154 -0.161799 -0.120462 -0.187472 0.118581 0.105757 0.094455 0.101621 0.097053 0.092700 0.102989 0.100135 0.141108 0.145597 0.124491 0.151968 0.153676 0.150511 0.144650 0.158063 0.156967 0.157642
qa: -0.0545 -0.0539 -0.2079 -0.2879 -0.4371 -0.3212 -0.0776 0.1318 -0.0574 -0.0950 -0.2663 -0.2808 -0.2034 0.3871 0.0730 0.5230 -0.0566 -0.2634 -0.1406 -0.2570 0.1330 -0.1514 0.2726 0.2870 -0.1763 -0.2472 -0.1618 -0.1205 -0.1875 0.1186 0.1058 0.0945 0.1016 0.0971 0.0927 0.1030 0.1001 0.1411 0.1456 0.1245 0.1520 0.1537 0.1505 0.1446 0.1581 0.1570 0.1576
va: 1.2897 1.2530 1.0848 2.1234 2.0663 2.0799 3.1039 3.7437 3.8951 3.8252 3.8893 3.9125 3.8888 4.1349 4.1896 3.7748 3.7353 4.1079 3.9662 3.9350 3.8385 3.8733 4.0026 3.6815 3.8721 3.9925 3.9171 3.8976 3.9042 1.0209 1.0275 1.0179 0.9993 1.0012 0.9998 0.9992 1.0027 1.0075 0.9886 1.0299 1.0130 0.9988 1.0076 1.0092 0.9910 0.9891 0.9903
dispcorr: -0.026064464 hartree
energy: -2149.961598974978
dipole: -0.12659 -1.29175 -1.41834 9.45597 -7.68912 1.76685 23.55424 -24.95422 -1.39998
magnitude: 2.66334 au
magnitude: 6.76967 debye
