program: Orca
programVersion: 5.0.2
elementType: Cl Cl F O O O N C C C C C C C C C C C C C C C C C C C C C C H H H H H H H H H H H H H H H H H H
charge: 0
multiplicity: 1
keywords: wb97x-d3
keywords: def2-TZVPP
keywords: def2/J RIJCOSX
keywords: DEFGRID2
keywords: scfconv7
keywords: smallprint printgap noloewdin
keywords: NOSOSCF
formula: C22H18Cl2FNO3
InChI: InChI=1/C22H18Cl2FNO3/c1-22(2)15(11-19(23)24)20(22)21(27)29-18(12-26)13-8-9-16(25)17(10-13)28-14-6-4-3-5-7-14/h3-11,15,18,20H,1-2H3
47 atoms
Cl -1.589951 4.972087 1.671622
Cl -4.381064 5.71703 1.617172
F  2.813804 -2.903765 -2.891272
O  0.269702 0.982546 1.281526
O  0.585122 2.224984 -0.548385
O  0.705958 -3.42689 -1.248221
N  2.141435 -0.403906 3.614344
C  -2.511011 1.507626 -0.837626
C  -2.294852 2.951125 -0.533734
C  -1.623372 1.916771 0.333182
C  -1.902294 0.930153 -2.090788
C  -3.819258 0.863623 -0.451946
C  -3.362284 3.800991 0.039197
C  -0.162253 1.760605 0.272895
C  -3.142603 4.70509 0.982715
C  1.651048 0.648002 1.273576
C  1.99147 -0.327067 0.171885
C  1.906763 0.056961 2.589141
C  1.225541 -1.476953 0.006404
C  3.046615 -0.062528 -0.685492
C  1.505416 -2.346864 -1.029884
C  3.343538 -0.939159 -1.719291
C  2.564786 -2.061943 -1.885707
C  1.214729 -4.689924 -1.086235
C  0.512349 -5.714673 -1.70772
C  2.339804 -4.962059 -0.320846
C  0.944397 -7.022951 -1.561149
C  2.76262 -6.279078 -0.189629
C  2.073473 -7.312867 -0.805247
H  -1.626473 3.472506 -1.214978
H  -2.055212 1.736615 1.311299
H  -1.643043 -0.121038 -1.950469
H  -2.625065 0.984083 -2.907071
H  -1.007935 1.457911 -2.416243
H  -4.22271 1.254707 0.482694
H  -4.568869 1.019284 -1.230439
H  -3.691559 -0.213247 -0.328733
H  -4.370016 3.704981 -0.349095
H  2.275727 1.54321 1.189032
H  0.399076 -1.702416 0.670296
H  3.639205 0.834458 -0.561539
H  4.157927 -0.738286 -2.402822
H  -0.364526 -5.484607 -2.300018
H  2.884739 -4.171911 0.180523
H  0.395996 -7.819308 -2.047698
H  3.640614 -6.491782 0.406504
H  2.410448 -8.335156 -0.696091
elementType: Cl F O N C H
totalener: -2149.93726258 hartree
nucrepener: 2921.22720919 hartree
electener: -5071.16447177 hartree
oneelecener: -8755.92949618 hartree
twoeener: 3684.76502441 hartree
cpcmener: -0.03170558 hartree
kineticenergy: 2143.47765151 hartree
xcener: -159.159878750845 hartree
chargesum: -0.0000000
charge: -0.050142 -0.055271 -0.206394 -0.280000 -0.432167 -0.326661 -0.086659 0.137601 -0.029956 -0.137442 -0.270513 -0.281093 -0.217828 0.381416 0.073581 0.423200 -0.003304 -0.229777 -0.200079 -0.150669 0.135883 -0.163944 0.266112 0.270872 -0.240664 -0.165921 -0.124063 -0.164729 -0.182267 0.112819 0.114572 0.098597 0.100279 0.095017 0.094079 0.102322 0.099851 0.139843 0.141390 0.140129 0.149689 0.153425 0.144484 0.151390 0.156544 0.158710 0.157737
qa: -0.0501 -0.0553 -0.2064 -0.2800 -0.4322 -0.3267 -0.0867 0.1376 -0.0300 -0.1374 -0.2705 -0.2811 -0.2178 0.3814 0.0736 0.4232 -0.0033 -0.2298 -0.2001 -0.1507 0.1359 -0.1639 0.2661 0.2709 -0.2407 -0.1659 -0.1241 -0.1647 -0.1823 0.1128 0.1146 0.0986 0.1003 0.0950 0.0941 0.1023 0.0999 0.1398 0.1414 0.1401 0.1497 0.1534 0.1445 0.1514 0.1565 0.1587 0.1577
va: 1.2798 1.2508 1.0868 2.1240 2.0805 2.0594 3.1119 3.7252 3.8784 3.8242 3.8929 3.9125 3.9051 4.1845 4.1884 3.7125 3.6026 4.0777 4.0002 3.9343 3.7741 3.9079 3.9986 3.6927 3.9898 3.8670 3.9025 3.9168 3.8992 1.0233 1.0233 0.9997 1.0023 1.0153 0.9993 0.9995 1.0032 1.0081 1.0145 1.0241 1.0004 0.9975 1.0094 1.0036 0.9894 0.9909 0.9902
dispcorr: -0.025138097 hartree
energy: -2149.962400681012
dipole: -0.21577 -0.44737 -0.66314 -29.75190 29.59744 -0.15446 -14.36292 12.95099 -1.41192
magnitude: 1.56753 au
magnitude: 3.98434 debye
