program: Orca
programVersion: 5.0.2
elementType: Cl Cl F O O O N C C C C C C C C C C C C C C C C C C C C C C H H H H H H H H H H H H H H H H H H
charge: 0
multiplicity: 1
keywords: wb97x-d3
keywords: def2-TZVPP
keywords: def2/J RIJCOSX
keywords: DEFGRID2
keywords: scfconv7
keywords: smallprint printgap noloewdin
keywords: NOSOSCF
formula: C22H18Cl2FNO3
InChI: InChI=1/C22H18Cl2FNO3/c1-22(2)15(11-19(23)24)20(22)21(27)29-18(12-26)13-8-9-16(25)17(10-13)28-14-6-4-3-5-7-14/h3-11,15,18,20H,1-2H3
47 atoms
Cl -4.987352 2.447229 -1.070086
Cl -5.281586 4.525388 0.909011
F  4.477323 -3.304328 1.530364
O  1.22624 1.78593 0.218649
O  -0.165775 0.530278 -1.002881
O  3.010229 -3.46959 -0.689816
N  3.985818 3.397038 -0.664283
C  -1.905032 0.636435 1.593714
C  -2.438941 1.618944 0.593263
C  -0.965931 1.646224 0.957955
C  -1.863555 -0.818855 1.194692
C  -2.186336 0.834098 3.06391
C  -3.275829 2.756514 0.994002
C  0.025825 1.245273 -0.053303
C  -4.363651 3.174964 0.359708
C  2.318438 1.388203 -0.609722
C  2.963019 0.142288 -0.060101
C  3.243198 2.522376 -0.622662
C  2.707509 -1.074945 -0.67614
C  3.738728 0.194301 1.092316
C  3.209266 -2.247588 -0.132183
C  4.265843 -0.969528 1.624165
C  3.987317 -2.17506 1.014816
C  1.756454 -3.809138 -1.133645
C  0.602493 -3.423838 -0.463226
C  1.687911 -4.602769 -2.268938
C  -0.630102 -3.83284 -0.951526
C  0.448299 -5.013086 -2.738032
C  -0.715278 -4.624684 -2.088416
H  -2.655931 1.194725 -0.380585
H  -0.645463 2.447796 1.613796
H  -2.772889 -1.31289 1.542142
H  -1.802689 -0.970208 0.119947
H  -1.01695 -1.326496 1.66126
H  -2.109578 1.873209 3.38146
H  -3.189588 0.481408 3.310488
H  -1.477712 0.259131 3.662401
H  -2.987616 3.309776 1.879963
H  1.993052 1.227912 -1.641826
H  2.112163 -1.11484 -1.579833
H  3.945478 1.137387 1.582684
H  4.87869 -0.945843 2.515557
H  0.652465 -2.81509 0.430896
H  2.596683 -4.897881 -2.778235
H  -1.529832 -3.53063 -0.430716
H  0.395602 -5.63328 -3.623494
H  -1.680602 -4.938292 -2.463079
elementType: Cl F O N C H
totalener: -2149.93861900 hartree
nucrepener: 2939.62740496 hartree
electener: -5089.56602396 hartree
oneelecener: -8791.94360965 hartree
twoeener: 3702.37758569 hartree
cpcmener: -0.03167720 hartree
kineticenergy: 2143.47143813 hartree
xcener: -159.161395683968 hartree
chargesum: -0.0000000
charge: -0.054401 -0.058994 -0.205745 -0.277587 -0.446120 -0.327402 -0.086737 0.108156 0.034782 -0.094835 -0.299164 -0.262072 -0.204752 0.409485 0.040410 0.402659 -0.024941 -0.224465 -0.141786 -0.182890 0.186337 -0.171214 0.211320 0.273463 -0.186957 -0.239809 -0.150943 -0.122618 -0.184149 0.084305 0.097784 0.103481 0.093207 0.105440 0.091268 0.102313 0.098720 0.129964 0.134762 0.150019 0.145421 0.152263 0.162713 0.147028 0.167275 0.157776 0.157228
qa: -0.0544 -0.0590 -0.2057 -0.2776 -0.4461 -0.3274 -0.0867 0.1082 0.0348 -0.0948 -0.2992 -0.2621 -0.2048 0.4095 0.0404 0.4027 -0.0249 -0.2245 -0.1418 -0.1829 0.1863 -0.1712 0.2113 0.2735 -0.1870 -0.2398 -0.1509 -0.1226 -0.1841 0.0843 0.0978 0.1035 0.0932 0.1054 0.0913 0.1023 0.0987 0.1300 0.1348 0.1500 0.1454 0.1523 0.1627 0.1470 0.1673 0.1578 0.1572
va: 1.2713 1.2457 1.0882 2.1325 2.0625 2.0868 3.1105 3.7155 3.8683 3.8772 3.9102 3.9062 3.8952 4.1746 4.2143 3.7362 3.6903 4.0661 3.8964 3.9582 3.7263 3.8991 4.0822 3.7280 3.8929 3.9984 3.8862 3.8948 3.9299 1.0446 1.0333 1.0019 1.0128 0.9945 1.0062 1.0011 1.0016 1.0181 1.0201 1.0139 1.0062 0.9981 0.9892 1.0069 0.9858 0.9885 0.9914
dispcorr: -0.025516521 hartree
energy: -2149.964135522454
dipole: 5.11552 -6.07258 -0.95707 -20.90338 20.01456 -0.88882 6.79686 -5.57793 1.21893
magnitude: 1.78655 au
magnitude: 4.54105 debye
