program: Orca
programVersion: 5.0.2
elementType: Cl Cl F O O O N C C C C C C C C C C C C C C C C C C C C C C H H H H H H H H H H H H H H H H H H
charge: 0
multiplicity: 1
keywords: wb97x-d3
keywords: def2-TZVPP
keywords: def2/J RIJCOSX
keywords: DEFGRID2
keywords: scfconv7
keywords: smallprint printgap noloewdin
keywords: NOSOSCF
formula: C22H18Cl2FNO3
InChI: InChI=1/C22H18Cl2FNO3/c1-22(2)15(11-19(23)24)20(22)21(27)29-18(12-26)13-8-9-16(25)17(10-13)28-14-6-4-3-5-7-14/h3-11,15,18,20H,1-2H3
47 atoms
Cl -2.392732 4.443297 -1.180895
Cl -4.561974 5.744378 0.21523
F  2.954632 -3.936202 1.389104
O  0.706062 1.845937 0.283424
O  -0.769666 0.564126 -0.796953
O  2.969449 -3.416418 -1.307965
N  3.866422 2.71885 -0.087063
C  -2.484158 1.237436 1.780898
C  -2.974674 2.008778 0.604386
C  -1.503184 2.047899 0.939818
C  -2.48805 -0.269289 1.716642
C  -2.733757 1.780273 3.166598
C  -3.784234 3.236952 0.762934
C  -0.538912 1.395864 0.042124
C  -3.605439 4.327045 0.031584
C  1.755383 1.217995 -0.436369
C  2.043626 -0.178037 0.063537
C  2.926475 2.075247 -0.231572
C  2.30822 -1.188287 -0.849216
C  2.063845 -0.443341 1.426759
C  2.622612 -2.46164 -0.405323
C  2.357692 -1.719833 1.877845
C  2.64524 -2.709229 0.961912
C  2.255838 -4.583071 -1.384328
C  0.938598 -4.693626 -0.961576
C  2.912645 -5.664661 -1.955529
C  0.284558 -5.910388 -1.104465
C  2.242889 -6.869457 -2.097649
C  0.928557 -7.001481 -1.668993
H  -3.225409 1.415127 -0.271891
H  -1.135865 2.948405 1.418889
H  -3.412943 -0.648944 2.155507
H  -2.42987 -0.656462 0.701353
H  -1.656964 -0.688274 2.287897
H  -2.676408 2.868714 3.211002
H  -3.723049 1.483526 3.521992
H  -1.998796 1.38377 3.869432
H  -4.58112 3.242267 1.498023
H  1.546875 1.201624 -1.511622
H  2.284211 -0.99222 -1.914609
H  1.858516 0.335796 2.149227
H  2.382708 -1.944358 2.93631
H  0.412259 -3.849891 -0.532458
H  3.939306 -5.561133 -2.283537
H  -0.74142 -5.998207 -0.770869
H  2.75736 -7.712546 -2.540409
H  0.411848 -7.945921 -1.775188
elementType: Cl F O N C H
totalener: -2149.93691922 hartree
nucrepener: 2910.12194022 hartree
electener: -5060.05885944 hartree
oneelecener: -8733.48172093 hartree
twoeener: 3673.42286149 hartree
cpcmener: -0.03233233 hartree
kineticenergy: 2143.48364738 hartree
xcener: -159.161536980647 hartree
chargesum: -0.0000000
charge: -0.049433 -0.054489 -0.206937 -0.279172 -0.435683 -0.321549 -0.086063 0.132864 -0.026952 -0.135361 -0.267760 -0.281124 -0.217775 0.377646 0.074587 0.412204 0.000292 -0.229538 -0.181966 -0.185350 0.149542 -0.171064 0.275441 0.282196 -0.176641 -0.248391 -0.157993 -0.120100 -0.185558 0.113484 0.115209 0.099196 0.095401 0.097359 0.094961 0.102447 0.099495 0.139957 0.141620 0.139702 0.150184 0.152780 0.154878 0.145215 0.158781 0.156371 0.157088
qa: -0.0494 -0.0545 -0.2069 -0.2792 -0.4357 -0.3215 -0.0861 0.1329 -0.0270 -0.1354 -0.2678 -0.2811 -0.2178 0.3776 0.0746 0.4122 0.0003 -0.2295 -0.1820 -0.1853 0.1495 -0.1711 0.2754 0.2822 -0.1766 -0.2484 -0.1580 -0.1201 -0.1856 0.1135 0.1152 0.0992 0.0954 0.0974 0.0950 0.1024 0.0995 0.1400 0.1416 0.1397 0.1502 0.1528 0.1549 0.1452 0.1588 0.1564 0.1571
va: 1.2810 1.2518 1.0841 2.1170 2.0743 2.0780 3.1131 3.7217 3.8790 3.8250 3.8921 3.9148 3.9046 4.1761 4.1883 3.7083 3.6197 4.0840 4.0299 3.9236 3.7770 3.9217 3.9769 3.6814 3.8754 3.9967 3.9116 3.8963 3.9035 1.0222 1.0231 1.0023 1.0160 1.0001 0.9990 0.9996 1.0031 1.0081 1.0181 1.0137 1.0104 0.9979 1.0026 1.0088 0.9909 0.9893 0.9905
dispcorr: -0.024904116 hartree
energy: -2149.961823338840
dipole: -2.65834 0.64509 -2.01325 -29.66971 28.66491 -1.00481 11.33590 -10.02114 1.31476
magnitude: 2.60604 au
magnitude: 6.62402 debye
