program: Orca
programVersion: 5.0.2
elementType: Cl Cl F O O O N C C C C C C C C C C C C C C C C C C C C C C H H H H H H H H H H H H H H H H H H
charge: 0
multiplicity: 1
keywords: wb97x-d3
keywords: def2-TZVPP
keywords: def2/J RIJCOSX
keywords: DEFGRID2
keywords: scfconv7
keywords: smallprint printgap noloewdin
keywords: NOSOSCF
formula: C22H18Cl2FNO3
InChI: InChI=1/C22H18Cl2FNO3/c1-22(2)15(11-19(23)24)20(22)21(27)29-18(12-26)13-8-9-16(25)17(10-13)28-14-6-4-3-5-7-14/h3-11,15,18,20H,1-2H3
47 atoms
Cl -2.94801 3.462032 -1.479186
Cl -4.642743 5.418399 -0.200405
F  3.939036 -3.001621 2.20728
O  0.474333 1.529787 -0.306892
O  -1.101255 -0.024298 0.009867
O  2.179875 -3.956496 0.508275
N  2.838152 2.079066 -2.523974
C  -1.870851 1.87401 2.421694
C  -2.796062 2.095941 1.275562
C  -1.30601 2.136484 1.030683
C  -1.798009 0.499319 3.037191
C  -1.647339 2.991368 3.411013
C  -3.58419 3.338587 1.122464
C  -0.680794 1.08528 0.216103
C  -3.707673 3.985158 -0.02763
C  1.225383 0.608357 -1.087579
C  1.990289 -0.3609 -0.220567
C  2.128904 1.440597 -1.884788
C  1.721746 -1.719683 -0.320405
C  2.914318 0.110602 0.702846
C  2.396647 -2.619229 0.490622
C  3.577002 -0.781437 1.530336
C  3.313536 -2.128627 1.413388
C  1.805692 -4.632139 -0.624357
C  2.367658 -4.375554 -1.868422
C  0.874067 -5.646763 -0.459562
C  1.970653 -5.139879 -2.95683
C  0.498511 -6.411475 -1.554169
C  1.037525 -6.157038 -2.807741
H  -3.291904 1.202106 0.90351
H  -0.866371 3.119044 0.903652
H  -2.507557 0.433223 3.864033
H  -2.041056 -0.297694 2.338239
H  -0.803299 0.303687 3.441601
H  -0.681234 2.872926 3.904621
H  -1.658232 3.976001 2.942208
H  -2.417095 2.980611 4.185102
H  -4.110266 3.731118 1.985482
H  0.582094 0.067302 -1.788663
H  0.982701 -2.071904 -1.029131
H  3.126318 1.169049 0.788167
H  4.299482 -0.435126 2.257868
H  3.107636 -3.595523 -1.99716
H  0.454432 -5.838904 0.520124
H  2.402539 -4.938253 -3.928653
H  -0.225279 -7.205388 -1.422559
H  0.736019 -6.74914 -3.661692
elementType: Cl F O N C H
totalener: -2149.93681700 hartree
nucrepener: 2915.48191538 hartree
electener: -5065.41873238 hartree
oneelecener: -8744.40071907 hartree
twoeener: 3678.98198668 hartree
cpcmener: -0.03109009 hartree
kineticenergy: 2143.48218045 hartree
xcener: -159.162702074188 hartree
chargesum: -0.0000000
charge: -0.049963 -0.054980 -0.207200 -0.272768 -0.444328 -0.320319 -0.087635 0.131943 -0.025411 -0.149982 -0.270406 -0.278276 -0.222671 0.402684 0.080154 0.402146 -0.018012 -0.225264 -0.161202 -0.203386 0.219279 -0.163269 0.197037 0.300392 -0.209812 -0.253065 -0.138992 -0.115229 -0.186526 0.112605 0.115271 0.097666 0.094510 0.100292 0.099792 0.094247 0.102053 0.140262 0.136370 0.147484 0.149010 0.151751 0.159564 0.147024 0.160434 0.158072 0.158650
qa: -0.0500 -0.0550 -0.2072 -0.2728 -0.4443 -0.3203 -0.0876 0.1319 -0.0254 -0.1500 -0.2704 -0.2783 -0.2227 0.4027 0.0802 0.4021 -0.0180 -0.2253 -0.1612 -0.2034 0.2193 -0.1633 0.1970 0.3004 -0.2098 -0.2531 -0.1390 -0.1152 -0.1865 0.1126 0.1153 0.0977 0.0945 0.1003 0.0998 0.0942 0.1021 0.1403 0.1364 0.1475 0.1490 0.1518 0.1596 0.1470 0.1604 0.1581 0.1586
va: 1.2813 1.2512 1.0849 2.1268 2.0699 2.0911 3.1127 3.7221 3.8684 3.8464 3.8936 3.9142 3.9126 4.1442 4.1811 3.7490 3.6518 4.0695 3.9145 3.9513 3.7162 3.8944 4.0687 3.6843 3.9240 4.0119 3.8866 3.8794 3.9119 1.0222 1.0235 1.0015 1.0177 0.9992 1.0032 0.9992 0.9998 1.0088 1.0172 1.0117 1.0073 0.9981 0.9951 1.0078 0.9897 0.9891 0.9904
dispcorr: -0.024407639 hartree
energy: -2149.961224640567
dipole: 4.07110 -5.09128 -1.02018 -19.69526 19.37255 -0.32271 13.56238 -12.17027 1.39211
magnitude: 1.75581 au
magnitude: 4.46292 debye
