program: Orca
programVersion: 5.0.2
elementType: Cl Cl F O O O N C C C C C C C C C C C C C C C C C C C C C C H H H H H H H H H H H H H H H H H H
charge: 0
multiplicity: 1
keywords: wb97x-d3
keywords: def2-TZVPP
keywords: def2/J RIJCOSX
keywords: DEFGRID2
keywords: scfconv7
keywords: smallprint printgap noloewdin
keywords: NOSOSCF
formula: C22H18Cl2FNO3
InChI: InChI=1/C22H18Cl2FNO3/c1-22(2)15(11-19(23)24)20(22)21(27)29-18(12-26)13-8-9-16(25)17(10-13)28-14-6-4-3-5-7-14/h3-11,15,18,20H,1-2H3
47 atoms
Cl -3.847182 -0.471057 1.50325
Cl -4.934793 -0.866232 -1.139115
F  4.661026 -3.179189 -0.29946
O  1.430757 2.254781 -0.805527
O  0.642277 2.030398 1.272837
O  2.134431 -2.771182 0.35291
N  3.519011 3.349564 1.770317
C  -1.947322 3.24343 -0.042574
C  -2.094737 1.761753 0.140588
C  -0.869068 2.314069 -0.565496
C  -1.711359 4.083177 1.188055
C  -2.759854 3.954944 -1.097165
C  -3.053806 0.968007 -0.636962
C  0.437669 2.185081 0.097051
C  -3.832315 0.011758 -0.146889
C  2.775699 2.100014 -0.401161
C  3.241754 0.658161 -0.345091
C  3.111277 2.802429 0.846198
C  2.399203 -0.389886 0.005127
C  4.568021 0.404111 -0.669016
C  2.876365 -1.691826 0.004929
C  5.059677 -0.890807 -0.638677
C  4.209074 -1.922579 -0.31297
C  0.784837 -2.806259 0.103956
C  0.242555 -2.387704 -1.104587
C  -0.019316 -3.343859 1.097849
C  -1.125923 -2.50411 -1.304981
C  -1.383434 -3.468078 0.876395
C  -1.942839 -3.045447 -0.32117
H  -1.911313 1.41649 1.151651
H  -0.839745 2.206195 -1.643824
H  -1.24136 3.536014 2.002113
H  -1.087327 4.948551 0.955769
H  -2.667433 4.45777 1.558047
H  -2.845803 3.392337 -2.025874
H  -3.768748 4.15494 -0.731775
H  -2.299317 4.914035 -1.340386
H  -3.141635 1.172756 -1.6972
H  3.352234 2.604987 -1.180195
H  1.367804 -0.226627 0.28251
H  5.227167 1.215558 -0.95104
H  6.091479 -1.100723 -0.888972
H  0.87159 -1.979165 -1.885973
H  0.420941 -3.668751 2.032667
H  -1.552996 -2.175223 -2.24384
H  -2.010691 -3.893042 1.649627
H  -3.007156 -3.141013 -0.488087
elementType: Cl F O N C H
totalener: -2149.93404637 hartree
nucrepener: 3074.02299274 hartree
electener: -5223.95703911 hartree
oneelecener: -9061.46560051 hartree
twoeener: 3837.50856140 hartree
cpcmener: -0.03582537 hartree
kineticenergy: 2143.46443479 hartree
xcener: -159.166841857693 hartree
chargesum: -0.0000000
charge: -0.054755 -0.061032 -0.207773 -0.272808 -0.431392 -0.321154 -0.093696 0.082493 0.045894 -0.070493 -0.263131 -0.265278 -0.228362 0.368542 0.059826 0.417858 -0.028925 -0.225723 -0.174171 -0.206510 0.220465 -0.152487 0.185136 0.282582 -0.188040 -0.235702 -0.155492 -0.130838 -0.167408 0.084567 0.096668 0.095536 0.100543 0.097649 0.090277 0.102708 0.099795 0.131033 0.148415 0.159729 0.146280 0.150600 0.157697 0.146773 0.154378 0.156266 0.153460
qa: -0.0548 -0.0610 -0.2078 -0.2728 -0.4314 -0.3212 -0.0937 0.0825 0.0459 -0.0705 -0.2631 -0.2653 -0.2284 0.3685 0.0598 0.4179 -0.0289 -0.2257 -0.1742 -0.2065 0.2205 -0.1525 0.1851 0.2826 -0.1880 -0.2357 -0.1555 -0.1308 -0.1674 0.0846 0.0967 0.0955 0.1005 0.0976 0.0903 0.1027 0.0998 0.1310 0.1484 0.1597 0.1463 0.1506 0.1577 0.1468 0.1544 0.1563 0.1535
va: 1.2682 1.2430 1.0847 2.1627 2.0621 2.0933 3.1067 3.7570 3.8306 3.8613 3.9061 3.9056 3.9079 4.1941 4.1947 3.8437 3.7889 4.0526 3.9265 3.9547 3.7285 3.8832 4.0691 3.6905 3.9104 4.0169 3.8428 3.9071 3.8405 1.0475 1.0341 1.0181 0.9996 0.9998 1.0057 1.0005 1.0013 1.0185 0.9974 1.0009 1.0011 0.9980 0.9946 1.0063 0.9956 0.9921 1.0054
dispcorr: -0.027938266 hartree
energy: -2149.961984637149
dipole: -0.69943 -0.17520 -0.87463 21.33687 -20.40382 0.93305 -5.32510 2.49649 -2.82861
magnitude: 3.10429 au
magnitude: 7.89048 debye
