program: Orca
programVersion: 5.0.2
elementType: Cl Cl F O O O N C C C C C C C C C C C C C C C C C C C C C C H H H H H H H H H H H H H H H H H H
charge: 0
multiplicity: 1
keywords: wb97x-d3
keywords: def2-TZVPP
keywords: def2/J RIJCOSX
keywords: DEFGRID2
keywords: scfconv7
keywords: smallprint printgap noloewdin
keywords: NOSOSCF
formula: C22H18Cl2FNO3
InChI: InChI=1/C22H18Cl2FNO3/c1-22(2)15(11-19(23)24)20(22)21(27)29-18(12-26)13-8-9-16(25)17(10-13)28-14-6-4-3-5-7-14/h3-11,15,18,20H,1-2H3
47 atoms
Cl -1.882682 4.789396 -0.337565
Cl -4.29696 5.730164 0.939603
F  3.25295 -4.104206 0.737558
O  0.720432 1.618888 0.656968
O  -0.47861 0.864633 -1.071235
O  2.659685 -3.210445 -1.785361
N  3.753759 2.883962 0.901329
C  -2.760736 0.749756 1.091568
C  -2.923073 1.956514 0.235259
C  -1.582782 1.695978 0.88537
C  -2.779515 -0.612268 0.443219
C  -3.346379 0.758254 2.482494
C  -3.721869 3.124128 0.668542
C  -0.437952 1.340325 0.034594
C  -3.354133 4.378161 0.449321
C  1.918547 1.27714 -0.034675
C  2.286414 -0.169287 0.178226
C  2.940828 2.177284 0.503659
C  2.272883 -1.047589 -0.896825
C  2.597599 -0.631962 1.451526
C  2.59766 -2.381074 -0.710396
C  2.91722 -1.965107 1.647553
C  2.92492 -2.820823 0.566269
C  1.897569 -4.349517 -1.816786
C  0.719532 -4.493007 -1.097032
C  2.349091 -5.363048 -2.650878
C  0.001402 -5.676425 -1.208541
C  1.615968 -6.534347 -2.757145
C  0.443149 -6.701169 -2.032486
H  -2.94909 1.768349 -0.835555
H  -1.33416 2.306574 1.745848
H  -3.793294 -1.015785 0.479449
H  -2.47552 -0.596983 -0.600884
H  -2.130018 -1.309352 0.976111
H  -3.286459 1.736534 2.961167
H  -4.397389 0.463291 2.456155
H  -2.820997 0.047031 3.122048
H  -4.66926 2.951691 1.166518
H  1.833027 1.494137 -1.10393
H  2.023286 -0.701216 -1.892251
H  2.604499 0.041016 2.299972
H  3.174317 -2.338376 2.63025
H  0.348757 -3.699702 -0.459532
H  3.267894 -5.233555 -3.20883
H  -0.91482 -5.790515 -0.64366
H  1.971102 -7.32462 -3.405925
H  -0.12185 -7.620341 -2.111351
elementType: Cl F O N C H
totalener: -2149.93731320 hartree
nucrepener: 2917.59952264 hartree
electener: -5067.53683585 hartree
oneelecener: -8748.47686781 hartree
twoeener: 3680.94003197 hartree
cpcmener: -0.03088585 hartree
kineticenergy: 2143.47790227 hartree
xcener: -159.159967547547 hartree
chargesum: -0.0000000
charge: -0.049536 -0.054122 -0.205770 -0.276726 -0.448035 -0.321682 -0.086855 0.131328 -0.033334 -0.142857 -0.273643 -0.278783 -0.214362 0.409797 0.073593 0.407081 -0.027394 -0.225377 -0.158024 -0.172972 0.144290 -0.172223 0.272278 0.278288 -0.174527 -0.246227 -0.160109 -0.122031 -0.183799 0.114127 0.112756 0.097711 0.095882 0.101494 0.094008 0.102110 0.099891 0.139803 0.135942 0.138599 0.150637 0.153347 0.157233 0.145426 0.158140 0.157421 0.157207
qa: -0.0495 -0.0541 -0.2058 -0.2767 -0.4480 -0.3217 -0.0869 0.1313 -0.0333 -0.1429 -0.2736 -0.2788 -0.2144 0.4098 0.0736 0.4071 -0.0274 -0.2254 -0.1580 -0.1730 0.1443 -0.1722 0.2723 0.2783 -0.1745 -0.2462 -0.1601 -0.1220 -0.1838 0.1141 0.1128 0.0977 0.0959 0.1015 0.0940 0.1021 0.0999 0.1398 0.1359 0.1386 0.1506 0.1533 0.1572 0.1454 0.1581 0.1574 0.1572
va: 1.2816 1.2521 1.0860 2.1289 2.0637 2.0777 3.1126 3.7201 3.8795 3.8489 3.8921 3.9154 3.9019 4.1436 4.1884 3.7296 3.6394 4.0747 3.9931 3.9531 3.7892 3.9301 3.9831 3.6835 3.8733 3.9967 3.9136 3.8965 3.9034 1.0220 1.0240 1.0017 1.0173 0.9986 0.9994 0.9995 1.0030 1.0083 1.0186 1.0203 1.0056 0.9983 0.9998 1.0088 0.9911 0.9889 0.9904
dispcorr: -0.024617984 hartree
energy: -2149.961931188344
dipole: -7.69327 5.65801 -2.03526 -33.44508 31.90687 -1.53821 2.27865 -1.48596 0.79269
magnitude: 2.67146 au
magnitude: 6.79032 debye
