program: Orca
programVersion: 5.0.2
elementType: Cl Cl F O O O N C C C C C C C C C C C C C C C C C C C C C C H H H H H H H H H H H H H H H H H H
charge: 0
multiplicity: 1
keywords: wb97x-d3
keywords: def2-TZVPP
keywords: def2/J RIJCOSX
keywords: DEFGRID2
keywords: scfconv7
keywords: smallprint printgap noloewdin
keywords: NOSOSCF
formula: C22H18Cl2FNO3
InChI: InChI=1/C22H18Cl2FNO3/c1-22(2)15(11-19(23)24)20(22)21(27)29-18(12-26)13-8-9-16(25)17(10-13)28-14-6-4-3-5-7-14/h3-11,15,18,20H,1-2H3
47 atoms
Cl -2.495982 2.039435 2.709584
Cl -5.364216 2.273362 2.457413
F  3.991762 -3.669873 -1.232015
O  0.54941 1.451616 -0.197798
O  0.602157 3.592442 0.425437
O  1.618258 -3.537438 0.149541
N  2.216726 1.554217 2.754386
C  -2.044039 3.707741 -1.31092
C  -2.337576 3.727232 0.147585
C  -1.435464 2.644455 -0.401719
C  -1.187366 4.801324 -1.896744
C  -3.102116 3.201079 -2.260409
C  -3.662801 3.365987 0.695571
C  -0.017913 2.658293 -0.015449
C  -3.820275 2.660819 1.806464
C  1.916878 1.333406 0.161775
C  2.427836 -0.01709 -0.26786
C  2.066215 1.475382 1.618364
C  1.74012 -1.177781 0.073417
C  3.621696 -0.094493 -0.967761
C  2.25914 -2.414151 -0.265894
C  4.150644 -1.330745 -1.309924
C  3.475519 -2.472319 -0.94362
C  1.35646 -4.548826 -0.740856
C  1.346519 -5.83703 -0.226368
C  1.073379 -4.312463 -2.078696
C  1.056583 -6.901895 -1.065559
C  0.795762 -5.390698 -2.90825
C  0.787734 -6.685966 -2.410437
H  -1.817181 4.495334 0.715152
H  -1.866128 1.655308 -0.508543
H  -1.824422 5.620387 -2.236336
H  -0.474951 5.218872 -1.188134
H  -0.63109 4.43807 -2.762735
H  -2.645512 2.838163 -3.182395
H  -3.689493 2.384153 -1.8399
H  -3.79076 4.005073 -2.528198
H  -4.552352 3.722466 0.188568
H  2.516632 2.117728 -0.309825
H  0.807197 -1.137422 0.623379
H  4.15461 0.806958 -1.240796
H  5.088613 -1.406991 -1.844238
H  1.567865 -6.002388 0.820562
H  1.062874 -3.306487 -2.480252
H  1.052897 -7.907158 -0.664603
H  0.581291 -5.209707 -3.953613
H  0.572309 -7.520463 -3.064333
elementType: Cl F O N C H
totalener: -2149.93721778 hartree
nucrepener: 2891.62747085 hartree
electener: -5041.56468863 hartree
oneelecener: -8697.05793946 hartree
twoeener: 3655.49325083 hartree
cpcmener: -0.03408527 hartree
kineticenergy: 2143.47225807 hartree
xcener: -159.159372737064 hartree
chargesum: -0.0000000
charge: -0.049521 -0.054924 -0.206385 -0.282448 -0.440533 -0.319867 -0.088552 0.127601 -0.035051 -0.127628 -0.267888 -0.279875 -0.213858 0.398412 0.074711 0.429400 -0.029398 -0.234712 -0.182498 -0.146443 0.117944 -0.167166 0.275162 0.264624 -0.241192 -0.167663 -0.122635 -0.154013 -0.181714 0.113345 0.115054 0.097553 0.094481 0.100916 0.100022 0.095223 0.102376 0.139825 0.127863 0.141135 0.149766 0.152674 0.146158 0.156588 0.156871 0.158402 0.157857
qa: -0.0495 -0.0549 -0.2064 -0.2824 -0.4405 -0.3199 -0.0886 0.1276 -0.0351 -0.1276 -0.2679 -0.2799 -0.2139 0.3984 0.0747 0.4294 -0.0294 -0.2347 -0.1825 -0.1464 0.1179 -0.1672 0.2752 0.2646 -0.2412 -0.1677 -0.1226 -0.1540 -0.1817 0.1133 0.1151 0.0976 0.0945 0.1009 0.1000 0.0952 0.1024 0.1398 0.1279 0.1411 0.1498 0.1527 0.1462 0.1566 0.1569 0.1584 0.1579
va: 1.2833 1.2513 1.0830 2.1574 2.0630 2.0760 3.1121 3.7252 3.8754 3.8466 3.8919 3.9151 3.9029 4.1466 4.1871 3.7175 3.7611 4.0148 4.0200 3.9143 3.8396 3.9265 3.9476 3.6884 4.0024 3.8837 3.8945 3.9058 3.8999 1.0241 1.0194 1.0013 1.0166 0.9992 1.0031 0.9986 0.9994 1.0084 1.0231 1.0246 0.9999 0.9986 1.0080 0.9983 0.9894 0.9908 0.9902
dispcorr: -0.023773093 hartree
energy: -2149.960990871321
dipole: 3.43136 -4.03116 -0.59980 2.32605 -2.16463 0.16142 -29.77098 26.28555 -3.48543
magnitude: 3.54034 au
magnitude: 8.99883 debye
