program: Orca
programVersion: 5.0.2
elementType: Cl Cl F O O O N C C C C C C C C C C C C C C C C C C C C C C H H H H H H H H H H H H H H H H H H
charge: 0
multiplicity: 1
keywords: wb97x-d3
keywords: def2-TZVPP
keywords: def2/J RIJCOSX
keywords: DEFGRID2
keywords: scfconv7
keywords: smallprint printgap noloewdin
keywords: NOSOSCF
formula: C22H18Cl2FNO3
InChI: InChI=1/C22H18Cl2FNO3/c1-22(2)15(11-19(23)24)20(22)21(27)29-18(12-26)13-8-9-16(25)17(10-13)28-14-6-4-3-5-7-14/h3-11,15,18,20H,1-2H3
47 atoms
Cl -5.201676 1.634964 -0.64568
Cl -5.597589 4.288664 0.412915
F  4.316488 -2.927862 1.859435
O  1.155545 2.009037 -0.240954
O  -0.268703 0.350428 -0.706913
O  3.102417 -3.438526 -0.428997
N  3.929365 3.185264 -1.587213
C  -1.56029 1.396122 1.973265
C  -2.396373 1.79034 0.789988
C  -0.912896 2.102093 0.795564
C  -1.325793 -0.075907 2.208628
C  -1.637423 2.192517 3.253372
C  -3.347727 2.906379 0.848943
C  -0.023574 1.376184 -0.126299
C  -4.546221 2.930159 0.279348
C  2.155543 1.354992 -1.016597
C  2.78219 0.212193 -0.255598
C  3.141597 2.391733 -1.325803
C  2.646701 -1.081218 -0.739127
C  3.4468 0.449614 0.94143
C  3.16163 -2.147106 -0.018208
C  3.979766 -0.610009 1.65742
C  3.822619 -1.892615 1.176035
C  1.966383 -3.929453 -1.018068
C  0.691519 -3.533801 -0.634369
C  2.147634 -4.89943 -1.993271
C  -0.406968 -4.114106 -1.252836
C  1.039339 -5.478483 -2.592714
C  -0.241625 -5.084478 -2.23159
H  -2.680968 0.965491 0.146665
H  -0.629458 3.13193 0.981379
H  -2.060982 -0.449546 2.924143
H  -1.419317 -0.678389 1.307584
H  -0.335378 -0.250441 2.634065
H  -1.687588 3.268436 3.089084
H  -2.514565 1.900999 3.834385
H  -0.755581 1.99962 3.866795
H  -3.055764 3.792859 1.399194
H  1.747788 1.000914 -1.968636
H  2.132963 -1.258112 -1.676051
H  3.558721 1.45625 1.325197
H  4.504432 -0.443456 2.589322
H  0.543687 -2.78757 0.136405
H  3.149248 -5.200119 -2.274283
H  -1.401352 -3.804184 -0.958265
H  1.183249 -6.236761 -3.351429
H  -1.104849 -5.531409 -2.706587
elementType: Cl F O N C H
totalener: -2149.93915307 hartree
nucrepener: 2923.06975543 hartree
electener: -5073.00890850 hartree
oneelecener: -8759.01201285 hartree
twoeener: 3686.00310435 hartree
cpcmener: -0.03189761 hartree
kineticenergy: 2143.46863398 hartree
xcener: -159.161023097727 hartree
chargesum: -0.0000000
charge: -0.054897 -0.059596 -0.206291 -0.273979 -0.443087 -0.323933 -0.086494 0.094023 0.031532 -0.077949 -0.266039 -0.268716 -0.207726 0.389323 0.044022 0.401949 -0.007163 -0.226179 -0.165818 -0.201549 0.208984 -0.165546 0.204914 0.290376 -0.193343 -0.246306 -0.150008 -0.119914 -0.180394 0.080637 0.099302 0.101056 0.090536 0.100626 0.092060 0.102762 0.098652 0.129496 0.136326 0.150465 0.148849 0.152546 0.158977 0.145752 0.157357 0.157759 0.156645
qa: -0.0549 -0.0596 -0.2063 -0.2740 -0.4431 -0.3239 -0.0865 0.0940 0.0315 -0.0779 -0.2660 -0.2687 -0.2077 0.3893 0.0440 0.4019 -0.0072 -0.2262 -0.1658 -0.2015 0.2090 -0.1655 0.2049 0.2904 -0.1933 -0.2463 -0.1500 -0.1199 -0.1804 0.0806 0.0993 0.1011 0.0905 0.1006 0.0921 0.1028 0.0987 0.1295 0.1363 0.1505 0.1488 0.1525 0.1590 0.1458 0.1574 0.1578 0.1566
va: 1.2709 1.2451 1.0871 2.1363 2.0684 2.0905 3.1122 3.7279 3.8739 3.8422 3.9122 3.9079 3.9013 4.2021 4.2128 3.7458 3.6216 4.0688 3.9183 3.9474 3.7118 3.8912 4.0757 3.7004 3.8991 4.0009 3.9030 3.8851 3.9093 1.0472 1.0318 1.0015 1.0144 0.9988 1.0057 1.0003 1.0013 1.0190 1.0171 1.0080 1.0072 0.9975 0.9917 1.0080 0.9912 0.9891 0.9907
dispcorr: -0.024677472 hartree
energy: -2149.963830544453
dipole: 10.03702 -10.83826 -0.80125 -14.02474 13.79076 -0.23398 9.07364 -7.84894 1.22469
magnitude: 1.48210 au
magnitude: 3.76719 debye
