program: Orca
programVersion: 5.0.2
elementType: Cl Cl F O O O N C C C C C C C C C C C C C C C C C C C C C C H H H H H H H H H H H H H H H H H H
charge: 0
multiplicity: 1
keywords: wb97x-d3
keywords: def2-TZVPP
keywords: def2/J RIJCOSX
keywords: DEFGRID2
keywords: scfconv7
keywords: smallprint printgap noloewdin
keywords: NOSOSCF
formula: C22H18Cl2FNO3
InChI: InChI=1/C22H18Cl2FNO3/c1-22(2)15(11-19(23)24)20(22)21(27)29-18(12-26)13-8-9-16(25)17(10-13)28-14-6-4-3-5-7-14/h3-11,15,18,20H,1-2H3
47 atoms
Cl -5.258733 1.371978 -0.330259
Cl -5.689826 4.153003 0.30928
F  4.299705 -2.827059 1.884981
O  1.134881 2.04857 -0.370272
O  -0.277571 0.336013 -0.633698
O  3.123827 -3.416628 -0.395931
N  3.885088 3.136451 -1.822706
C  -1.459592 1.6369 2.005845
C  -2.36689 1.847582 0.827624
C  -0.901987 2.214332 0.717567
C  -1.142159 0.217637 2.40674
C  -1.522369 2.581177 3.181024
C  -3.361085 2.927061 0.793611
C  -0.029645 1.414184 -0.159084
C  -4.597175 2.820853 0.323117
C  2.114871 1.345944 -1.128653
C  2.748284 0.233924 -0.329114
C  3.100898 2.35977 -1.506275
C  2.638698 -1.072996 -0.781196
C  3.392973 0.513046 0.869676
C  3.155593 -2.113476 -0.024935
C  3.929749 -0.520387 1.620145
C  3.797284 -1.817017 1.170357
C  2.031195 -3.949081 -1.027964
C  0.730075 -3.538221 -0.767564
C  2.285639 -4.98367 -1.917079
C  -0.318051 -4.167758 -1.424844
C  1.22654 -5.610706 -2.555238
C  -0.078837 -5.201879 -2.319016
H  -2.644658 0.937485 0.308206
H  -0.655145 3.269405 0.760052
H  -0.141836 0.152606 2.839232
H  -1.85143 -0.112891 3.167482
H  -1.200136 -0.490046 1.582565
H  -2.349037 2.312775 3.841522
H  -0.600926 2.51942 3.762383
H  -1.652934 3.622354 2.888883
H  -3.068347 3.899149 1.172338
H  1.685838 0.95156 -2.055398
H  2.141414 -1.279964 -1.720743
H  3.48475 1.530923 1.22762
H  4.438758 -0.32353 2.554745
H  0.521055 -2.741613 -0.064428
H  3.30601 -5.296166 -2.101201
H  -1.331854 -3.844775 -1.226795
H  1.428034 -6.418468 -3.246781
H  -0.902955 -5.686641 -2.825363
elementType: Cl F O N C H
totalener: -2149.93896159 hartree
nucrepener: 2918.32676955 hartree
electener: -5068.26573114 hartree
oneelecener: -8749.53797324 hartree
twoeener: 3681.27224211 hartree
cpcmener: -0.03182651 hartree
kineticenergy: 2143.47420120 hartree
xcener: -159.162497878712 hartree
chargesum: -0.0000000
charge: -0.055076 -0.059656 -0.206564 -0.272591 -0.440595 -0.321826 -0.086158 0.088374 0.033091 -0.076628 -0.259391 -0.263979 -0.206502 0.382294 0.041770 0.401445 0.001747 -0.226695 -0.188375 -0.208522 0.228276 -0.160682 0.198853 0.304941 -0.203813 -0.254437 -0.148829 -0.116172 -0.184026 0.080342 0.100500 0.099019 0.100541 0.089124 0.102183 0.098049 0.091040 0.129837 0.137396 0.151917 0.149020 0.152569 0.159675 0.145701 0.158356 0.157629 0.156824
qa: -0.0551 -0.0597 -0.2066 -0.2726 -0.4406 -0.3218 -0.0862 0.0884 0.0331 -0.0766 -0.2594 -0.2640 -0.2065 0.3823 0.0418 0.4014 0.0017 -0.2267 -0.1884 -0.2085 0.2283 -0.1607 0.1989 0.3049 -0.2038 -0.2544 -0.1488 -0.1162 -0.1840 0.0803 0.1005 0.0990 0.1005 0.0891 0.1022 0.0980 0.0910 0.1298 0.1374 0.1519 0.1490 0.1526 0.1597 0.1457 0.1584 0.1576 0.1568
va: 1.2704 1.2451 1.0865 2.1367 2.0716 2.0946 3.1123 3.7431 3.8691 3.8374 3.9092 3.9050 3.8992 4.2117 4.2138 3.7461 3.6128 4.0703 3.9317 3.9451 3.7004 3.8844 4.0753 3.6881 3.9055 4.0022 3.9010 3.8816 3.9120 1.0482 1.0314 0.9999 1.0017 1.0156 1.0009 1.0016 1.0055 1.0184 1.0165 1.0054 1.0079 0.9973 0.9916 1.0084 0.9909 0.9890 0.9906
dispcorr: -0.024532398 hartree
energy: -2149.963493984099
dipole: 11.45567 -12.19037 -0.73470 -11.60675 11.54966 -0.05709 8.51146 -7.38193 1.12953
magnitude: 1.34866 au
magnitude: 3.42802 debye
