program: Orca
programVersion: 5.0.2
elementType: Cl Cl F O O O N C C C C C C C C C C C C C C C C C C C C C C H H H H H H H H H H H H H H H H H H
charge: 0
multiplicity: 1
keywords: wb97x-d3
keywords: def2-TZVPP
keywords: def2/J RIJCOSX
keywords: DEFGRID2
keywords: scfconv7
keywords: smallprint printgap noloewdin
keywords: NOSOSCF
formula: C22H18Cl2FNO3
InChI: InChI=1/C22H18Cl2FNO3/c1-22(2)15(11-19(23)24)20(22)21(27)29-18(12-26)13-8-9-16(25)17(10-13)28-14-6-4-3-5-7-14/h3-11,15,18,20H,1-2H3
47 atoms
Cl -4.130035 4.424503 -0.477572
Cl -5.613762 3.389048 1.77019
F  4.98609 -2.840095 -1.835713
O  0.981025 0.886413 1.291587
O  0.687673 2.110231 -0.557772
O  2.750944 -3.512175 -0.551335
N  3.283838 0.868517 3.654176
C  -2.02985 0.542744 -0.665476
C  -2.29143 1.892923 -0.063768
C  -1.179076 1.025722 0.493992
C  -1.470847 0.497963 -2.066331
C  -2.953326 -0.611376 -0.36075
C  -3.45584 2.144292 0.795989
C  0.225922 1.423219 0.31448
C  -4.277065 3.181969 0.703283
C  2.382152 1.071008 1.209093
C  3.04972 0.027421 0.341578
C  2.869152 0.95798 2.586889
C  2.529507 -1.258645 0.273398
C  4.221869 0.346479 -0.328881
C  3.181972 -2.225889 -0.474018
C  4.888538 -0.62329 -1.061717
C  4.360578 -1.894603 -1.129735
C  1.42743 -3.753765 -0.823268
C  0.746602 -3.058852 -1.814524
C  0.805122 -4.762664 -0.104059
C  -0.574884 -3.387324 -2.081194
C  -0.515263 -5.083338 -0.386088
C  -1.211422 -4.396658 -1.370944
H  -1.960534 2.728098 -0.671122
H  -1.38617 0.539493 1.440586
H  -2.290192 0.373089 -2.776536
H  -0.933469 1.40055 -2.347354
H  -0.796474 -0.351433 -2.190597
H  -2.446747 -1.558053 -0.557659
H  -3.287227 -0.633036 0.675879
H  -3.839357 -0.570631 -0.997117
H  -3.667072 1.42724 1.580308
H  2.637046 2.074654 0.853036
H  1.623737 -1.523922 0.805611
H  4.624503 1.350134 -0.278919
H  5.803915 -0.389591 -1.589613
H  1.237354 -2.2786 -2.383643
H  1.35099 -5.293791 0.665598
H  -1.106578 -2.852286 -2.857461
H  -1.001001 -5.871536 0.174468
H  -2.241721 -4.647121 -1.586617
elementType: Cl F O N C H
totalener: -2149.93793049 hartree
nucrepener: 2956.51037619 hartree
electener: -5106.44830668 hartree
oneelecener: -8825.45637671 hartree
twoeener: 3719.00807003 hartree
cpcmener: -0.03271572 hartree
kineticenergy: 2143.46859196 hartree
xcener: -159.161080957091 hartree
chargesum: -0.0000000
charge: -0.054029 -0.058737 -0.207113 -0.290746 -0.438288 -0.328436 -0.085814 0.108784 0.021722 -0.080087 -0.272058 -0.257129 -0.197404 0.381869 0.034284 0.403549 0.007971 -0.231306 -0.112090 -0.184977 0.126865 -0.161070 0.211969 0.234020 -0.131598 -0.221442 -0.205859 -0.129311 -0.157268 0.086301 0.096431 0.103053 0.101496 0.086487 0.090123 0.091795 0.101967 0.129914 0.144082 0.149962 0.147749 0.151875 0.158646 0.148399 0.167657 0.158193 0.159601
qa: -0.0540 -0.0587 -0.2071 -0.2907 -0.4383 -0.3284 -0.0858 0.1088 0.0217 -0.0801 -0.2721 -0.2571 -0.1974 0.3819 0.0343 0.4035 0.0080 -0.2313 -0.1121 -0.1850 0.1269 -0.1611 0.2120 0.2340 -0.1316 -0.2214 -0.2059 -0.1293 -0.1573 0.0863 0.0964 0.1031 0.1015 0.0865 0.0901 0.0918 0.1020 0.1299 0.1441 0.1500 0.1477 0.1519 0.1586 0.1484 0.1677 0.1582 0.1596
va: 1.2718 1.2463 1.0863 2.1096 2.0751 2.0744 3.1144 3.6904 3.9055 3.8572 3.9020 3.9102 3.8893 4.1902 4.2147 3.7111 3.6798 4.0763 3.8867 3.9521 3.7655 3.8785 4.0662 3.7369 3.8348 3.9912 3.8701 3.9001 3.8548 1.0429 1.0359 1.0003 1.0217 1.0054 1.0066 1.0067 1.0017 1.0174 1.0225 1.0168 1.0001 0.9973 0.9962 1.0058 0.9850 0.9886 0.9898
dispcorr: -0.026233123 hartree
energy: -2149.964163613606
dipole: 1.73289 -2.80595 -1.07305 -22.79545 22.11660 -0.67885 -10.71604 9.55444 -1.16160
magnitude: 1.72093 au
magnitude: 4.37425 debye
