program: Orca
programVersion: 5.0.2
elementType: Cl Cl F O O O N C C C C C C C C C C C C C C C C C C C C C C H H H H H H H H H H H H H H H H H H
charge: 0
multiplicity: 1
keywords: wb97x-d3
keywords: def2-TZVPP
keywords: def2/J RIJCOSX
keywords: DEFGRID2
keywords: scfconv7
keywords: smallprint printgap noloewdin
keywords: NOSOSCF
formula: C22H18Cl2FNO3
InChI: InChI=1/C22H18Cl2FNO3/c1-22(2)15(11-19(23)24)20(22)21(27)29-18(12-26)13-8-9-16(25)17(10-13)28-14-6-4-3-5-7-14/h3-11,15,18,20H,1-2H3
47 atoms
Cl -5.319699 1.36683 -0.006398
Cl -5.728568 4.22052 0.094734
F  4.076755 -2.771364 2.245248
O  1.143063 1.969907 -0.607855
O  -0.348317 0.307214 -0.629245
O  3.120013 -3.554689 -0.099475
N  3.977369 2.698125 -2.108254
C  -1.349359 2.051813 1.847182
C  -2.329512 2.051795 0.706595
C  -0.879066 2.384709 0.443206
C  -1.000232 0.724376 2.474379
C  -1.344336 3.190767 2.836593
C  -3.336278 3.10948 0.551051
C  -0.050374 1.429205 -0.313079
C  -4.614104 2.915902 0.250011
C  2.083535 1.116698 -1.249812
C  2.641032 0.076546 -0.308069
C  3.139572 2.013578 -1.72363
C  2.606117 -1.260359 -0.675103
C  3.164933 0.456729 0.921238
C  3.085914 -2.230655 0.19198
C  3.65688 -0.506772 1.786571
C  3.60774 -1.834138 1.416715
C  2.08838 -4.140551 -0.788245
C  2.431329 -5.14356 -1.682503
C  0.758716 -3.800014 -0.57484
C  1.430525 -5.813262 -2.371084
C  -0.22992 -4.471125 -1.280576
C  0.097877 -5.476562 -2.179853
H  -2.633957 1.064326 0.378759
H  -0.631079 3.427884 0.280198
H  -1.66874 0.531152 3.315441
H  -1.092655 -0.116162 1.789173
H  0.021121 0.734541 2.860809
H  -0.390498 3.224234 3.365972
H  -1.490442 4.165139 2.371763
H  -2.130901 3.054266 3.581321
H  -3.020004 4.136678 0.689787
H  1.643502 0.636247 -2.129711
H  2.198513 -1.545777 -1.637327
H  3.197932 1.498343 1.214512
H  4.070837 -0.231756 2.747857
H  3.472335 -5.400184 -1.832636
H  0.485128 -3.023438 0.128589
H  1.698918 -6.597629 -3.066736
H  -1.266068 -4.203534 -1.119022
H  -0.679593 -5.994597 -2.725612
elementType: Cl F O N C H
totalener: -2149.93902657 hartree
nucrepener: 2909.63164588 hartree
electener: -5059.57067245 hartree
oneelecener: -8732.17655535 hartree
twoeener: 3672.60588290 hartree
cpcmener: -0.03256953 hartree
kineticenergy: 2143.46753761 hartree
xcener: -159.160803301515 hartree
chargesum: -0.0000000
charge: -0.055003 -0.059358 -0.207138 -0.272920 -0.434557 -0.324203 -0.086195 0.090809 0.030736 -0.073649 -0.261308 -0.262779 -0.206172 0.368010 0.040671 0.406298 0.008441 -0.227556 -0.174560 -0.219035 0.210639 -0.160394 0.206929 0.280815 -0.246129 -0.186608 -0.119500 -0.147901 -0.181739 0.079120 0.101269 0.102269 0.092927 0.096274 0.098343 0.090547 0.102544 0.131013 0.137876 0.150248 0.148561 0.152416 0.146645 0.159407 0.157612 0.158786 0.157498
qa: -0.0550 -0.0594 -0.2071 -0.2729 -0.4346 -0.3242 -0.0862 0.0908 0.0307 -0.0736 -0.2613 -0.2628 -0.2062 0.3680 0.0407 0.4063 0.0084 -0.2276 -0.1746 -0.2190 0.2106 -0.1604 0.2069 0.2808 -0.2461 -0.1866 -0.1195 -0.1479 -0.1817 0.0791 0.1013 0.1023 0.0929 0.0963 0.0983 0.0905 0.1025 0.1310 0.1379 0.1502 0.1486 0.1524 0.1466 0.1594 0.1576 0.1588 0.1575
va: 1.2704 1.2455 1.0859 2.1327 2.0761 2.0878 3.1123 3.7436 3.8716 3.8296 3.9072 3.9027 3.8952 4.2362 4.2127 3.7332 3.6146 4.0773 3.9337 3.9284 3.7103 3.8810 4.0699 3.7016 4.0044 3.9023 3.8840 3.8996 3.9078 1.0493 1.0309 1.0013 1.0145 1.0011 1.0018 1.0057 1.0009 1.0173 1.0183 1.0043 1.0100 0.9971 1.0074 0.9948 0.9891 0.9907 0.9904
dispcorr: -0.024531958 hartree
energy: -2149.963558524542
dipole: 12.99029 -13.72120 -0.73091 -9.29223 9.47852 0.18629 7.09019 -6.15078 0.93941
magnitude: 1.20475 au
magnitude: 3.06223 debye
