program: Orca
programVersion: 5.0.2
elementType: Cl Cl F O O O N C C C C C C C C C C C C C C C C C C C C C C H H H H H H H H H H H H H H H H H H
charge: 0
multiplicity: 1
keywords: wb97x-d3
keywords: def2-TZVPP
keywords: def2/J RIJCOSX
keywords: DEFGRID2
keywords: scfconv7
keywords: smallprint printgap noloewdin
keywords: NOSOSCF
formula: C22H18Cl2FNO3
InChI: InChI=1/C22H18Cl2FNO3/c1-22(2)15(11-19(23)24)20(22)21(27)29-18(12-26)13-8-9-16(25)17(10-13)28-14-6-4-3-5-7-14/h3-11,15,18,20H,1-2H3
47 atoms
Cl -3.112566 4.539797 0.257221
Cl -5.320418 3.54466 1.823684
F  4.933563 -3.292701 -0.841156
O  0.757035 1.309883 0.24128
O  0.690833 -0.107516 1.959696
O  2.504049 -2.90622 -1.885725
N  2.796045 2.45685 2.702048
C  -2.035657 0.235295 -0.491979
C  -2.139304 1.534354 0.252058
C  -1.336998 0.384291 0.846446
C  -1.275841 0.215172 -1.795797
C  -3.215784 -0.707746 -0.50609
C  -3.372763 1.940508 0.936662
C  0.114107 0.479285 1.080654
C  -3.859578 3.17382 0.989836
C  2.160001 1.43543 0.378354
C  2.922153 0.159863 0.073227
C  2.496691 1.983459 1.699189
C  2.361585 -0.768836 -0.791018
C  4.186997 -0.065592 0.599643
C  3.028335 -1.948305 -1.077776
C  4.880995 -1.222171 0.275958
C  4.291863 -2.158316 -0.545784
C  1.188988 -3.26349 -1.721226
C  0.578064 -3.300921 -0.472867
C  0.494664 -3.631911 -2.863896
C  -0.744042 -3.710806 -0.382106
C  -0.824279 -4.049639 -2.754471
C  -1.450961 -4.086344 -1.516976
H  -1.548054 2.341677 -0.163702
H  -1.817755 -0.150941 1.657389
H  -1.972733 0.384575 -2.618748
H  -0.504802 0.978567 -1.865761
H  -0.813938 -0.761311 -1.958792
H  -3.962205 -0.370962 -1.227976
H  -2.893068 -1.705408 -0.806829
H  -3.70534 -0.804679 0.462019
H  -3.940359 1.17479 1.451671
H  2.432937 2.202503 -0.351884
H  1.391176 -0.601319 -1.239821
H  4.65043 0.647623 1.268931
H  5.866553 -1.405202 0.683866
H  1.115167 -3.018542 0.424005
H  0.985493 -3.597304 -3.828463
H  -1.221321 -3.738626 0.58907
H  -1.363922 -4.340692 -3.646426
H  -2.480888 -4.408007 -1.435732
elementType: Cl F O N C H
totalener: -2149.93360117 hartree
nucrepener: 3035.87490181 hartree
electener: -5185.80850299 hartree
oneelecener: -8984.29454354 hartree
twoeener: 3798.48604055 hartree
cpcmener: -0.03499707 hartree
kineticenergy: 2143.45977544 hartree
xcener: -159.166924856641 hartree
chargesum: -0.0000000
charge: -0.054853 -0.058696 -0.208632 -0.284205 -0.421685 -0.326870 -0.079876 0.099455 0.043555 -0.068286 -0.264056 -0.279411 -0.223105 0.383651 0.043875 0.451545 -0.050652 -0.241261 -0.207573 -0.174245 0.189691 -0.163921 0.201083 0.266351 -0.166368 -0.219918 -0.176098 -0.121127 -0.178728 0.090094 0.096811 0.113479 0.101088 0.062756 0.105249 0.093559 0.095791 0.129058 0.143735 0.193793 0.137040 0.150983 0.152269 0.144953 0.161502 0.158148 0.160053
qa: -0.0549 -0.0587 -0.2086 -0.2842 -0.4217 -0.3269 -0.0799 0.0995 0.0436 -0.0683 -0.2641 -0.2794 -0.2231 0.3837 0.0439 0.4515 -0.0507 -0.2413 -0.2076 -0.1742 0.1897 -0.1639 0.2011 0.2664 -0.1664 -0.2199 -0.1761 -0.1211 -0.1787 0.0901 0.0968 0.1135 0.1011 0.0628 0.1052 0.0936 0.0958 0.1291 0.1437 0.1938 0.1370 0.1510 0.1523 0.1450 0.1615 0.1581 0.1601
va: 1.2714 1.2466 1.0844 2.1305 2.0725 2.0935 3.1033 3.6763 3.8816 3.8665 3.8911 3.9104 3.8996 4.1923 4.2170 3.8226 3.8002 4.0968 3.9251 3.9234 3.7249 3.8991 4.0712 3.6919 3.8317 3.9756 3.8476 3.8842 3.8539 1.0424 1.0302 1.0031 1.0124 1.0131 1.0022 1.0111 1.0065 1.0209 0.9900 0.9624 1.0117 0.9982 1.0037 1.0074 0.9906 0.9888 0.9896
dispcorr: -0.029205765 hartree
energy: -2149.962806938035
dipole: -2.01161 0.79904 -1.21257 -24.08434 23.49218 -0.59215 -13.65114 11.45157 -2.19957
magnitude: 2.58052 au
magnitude: 6.55917 debye
