program: Orca
programVersion: 5.0.2
elementType: Cl Cl F O O O N C C C C C C C C C C C C C C C C C C C C C C H H H H H H H H H H H H H H H H H H
charge: 0
multiplicity: 1
keywords: wb97x-d3
keywords: def2-TZVPP
keywords: def2/J RIJCOSX
keywords: DEFGRID2
keywords: scfconv7
keywords: smallprint printgap noloewdin
keywords: NOSOSCF
formula: C22H18Cl2FNO3
InChI: InChI=1/C22H18Cl2FNO3/c1-22(2)15(11-19(23)24)20(22)21(27)29-18(12-26)13-8-9-16(25)17(10-13)28-14-6-4-3-5-7-14/h3-11,15,18,20H,1-2H3
47 atoms
Cl -3.998051 -0.066329 1.989398
Cl -5.162772 -0.804783 -0.545008
F  4.406819 -3.126832 0.679204
O  1.460524 2.102562 -1.198482
O  1.026897 1.734436 0.961521
O  2.208035 -2.850499 -0.827931
N  3.647825 3.872893 0.707942
C  -1.751255 2.960867 0.081731
C  -1.883385 1.477338 0.272854
C  -0.774978 2.017488 -0.601474
C  -1.319287 3.791739 1.263925
C  -2.716569 3.677444 -0.829849
C  -2.973138 0.726202 -0.370957
C  0.623719 1.923328 -0.155421
C  -3.913774 0.050542 0.274566
C  2.850183 2.013131 -0.950796
C  3.299205 0.629957 -0.519713
C  3.27308 3.049134 0.001211
C  2.554815 -0.473846 -0.909952
C  4.457665 0.451752 0.224315
C  2.923274 -1.743256 -0.496131
C  4.852048 -0.820201 0.608637
C  4.069624 -1.901819 0.2674
C  0.85096 -2.839072 -0.62189
C  0.076528 -3.567332 -1.512312
C  0.267588 -2.168378 0.446639
C  -1.298034 -3.624901 -1.329855
C  -1.107955 -2.23352 0.612074
C  -1.897481 -2.956409 -0.271885
H  -1.571505 1.115365 1.246878
H  -0.911575 1.918113 -1.672701
H  -0.733617 4.654706 0.941689
H  -2.202652 4.169914 1.781218
H  -0.732355 3.236569 1.991838
H  -2.291369 4.627195 -1.158684
H  -2.967278 3.1044 -1.722007
H  -3.64692 3.895817 -0.302075
H  -3.025947 0.730451 -1.45337
H  3.313193 2.265915 -1.909174
H  1.666997 -0.366283 -1.520894
H  5.064978 1.2957 0.524775
H  5.747957 -0.964916 1.197962
H  0.546105 -4.084076 -2.339943
H  0.866956 -1.604324 1.150284
H  -1.901702 -4.191575 -2.027026
H  -1.559837 -1.719347 1.449949
H  -2.969791 -3.00072 -0.13524
elementType: Cl F O N C H
totalener: -2149.93600983 hartree
nucrepener: 3093.35854360 hartree
electener: -5243.29455343 hartree
oneelecener: -9099.99983613 hartree
twoeener: 3856.70528271 hartree
cpcmener: -0.03317532 hartree
kineticenergy: 2143.48055250 hartree
xcener: -159.169002790244 hartree
chargesum: -0.0000000
charge: -0.056071 -0.057408 -0.208514 -0.290263 -0.425894 -0.329452 -0.082479 0.110259 -0.021289 -0.066948 -0.271334 -0.256867 -0.167506 0.372051 0.017430 0.507942 -0.050726 -0.254700 -0.208003 -0.172832 0.189912 -0.163052 0.206092 0.285676 -0.243061 -0.185424 -0.120498 -0.159058 -0.168001 0.095272 0.097623 0.103498 0.098308 0.095969 0.100693 0.089736 0.101685 0.137586 0.148454 0.152820 0.137679 0.151540 0.145816 0.150135 0.156425 0.156058 0.150719
qa: -0.0561 -0.0574 -0.2085 -0.2903 -0.4259 -0.3295 -0.0825 0.1103 -0.0213 -0.0669 -0.2713 -0.2569 -0.1675 0.3721 0.0174 0.5079 -0.0507 -0.2547 -0.2080 -0.1728 0.1899 -0.1631 0.2061 0.2857 -0.2431 -0.1854 -0.1205 -0.1591 -0.1680 0.0953 0.0976 0.1035 0.0983 0.0960 0.1007 0.0897 0.1017 0.1376 0.1485 0.1528 0.1377 0.1515 0.1458 0.1501 0.1564 0.1561 0.1507
va: 1.2667 1.2479 1.0844 2.1321 2.0728 2.0884 3.1013 3.7852 3.8564 3.8596 3.9058 3.9030 3.8050 4.1767 4.1886 3.7735 3.7577 4.0921 3.9445 3.9240 3.7157 3.8992 4.0841 3.6861 4.0108 3.8911 3.9236 3.8566 3.8615 1.0312 1.0366 0.9998 1.0011 1.0176 1.0021 1.0040 1.0016 1.0125 0.9871 1.0118 1.0120 0.9981 1.0070 1.0072 0.9892 1.0006 1.0051
dispcorr: -0.029422653 hartree
energy: -2149.965432482091
dipole: 1.33942 -2.15821 -0.81879 18.24548 -17.66243 0.58305 -6.25339 4.09223 -2.16116
magnitude: 2.38348 au
magnitude: 6.05832 debye
