program: Orca
programVersion: 5.0.2
elementType: Cl Cl F O O O N C C C C C C C C C C C C C C C C C C C C C C H H H H H H H H H H H H H H H H H H
charge: 0
multiplicity: 1
keywords: wb97x-d3
keywords: def2-TZVPP
keywords: def2/J RIJCOSX
keywords: DEFGRID2
keywords: scfconv7
keywords: smallprint printgap noloewdin
keywords: NOSOSCF
formula: C22H18Cl2FNO3
InChI: InChI=1/C22H18Cl2FNO3/c1-22(2)15(11-19(23)24)20(22)21(27)29-18(12-26)13-8-9-16(25)17(10-13)28-14-6-4-3-5-7-14/h3-11,15,18,20H,1-2H3
47 atoms
Cl -2.389375 -0.781496 -2.370096
Cl -4.29212 0.89555 -3.737757
F  3.935606 -3.357449 -0.649204
O  0.923584 1.931742 0.057093
O  0.904364 4.147786 0.289008
O  2.024453 -2.954831 1.131981
N  2.753291 2.559967 2.847058
C  -2.11647 2.397799 0.739347
C  -1.83998 1.764656 -0.597857
C  -1.134261 3.047511 -0.216217
C  -1.623305 1.671986 1.967088
C  -3.407288 3.143453 0.973393
C  -2.822032 1.795967 -1.688575
C  0.313044 3.12278 0.064662
C  -3.118705 0.775471 -2.483157
C  2.312403 1.895069 0.354296
C  2.783196 0.487012 0.104968
C  2.540441 2.282254 1.753125
C  2.177925 -0.564543 0.78581
C  3.784291 0.242692 -0.820176
C  2.553729 -1.868767 0.518929
C  4.188564 -1.062102 -1.06975
C  3.567547 -2.096358 -0.408866
C  0.725874 -2.91873 1.5797
C  0.481313 -3.39981 2.855762
C  -0.312002 -2.470991 0.772241
C  -0.822808 -3.432152 3.330388
C  -1.607632 -2.491844 1.266842
C  -1.869055 -2.971752 2.543839
H  -1.235392 0.867367 -0.547712
H  -1.49756 3.959367 -0.677904
H  -2.408534 1.014524 2.344726
H  -0.748039 1.051549 1.782023
H  -1.374415 2.378479 2.761355
H  -3.722432 3.736757 0.115886
H  -4.213055 2.44724 1.213717
H  -3.298462 3.826904 1.817296
H  -3.352941 2.723122 -1.869576
H  2.868093 2.59423 -0.277638
H  1.408018 -0.367189 1.522411
H  4.251498 1.060126 -1.353342
H  4.969353 -1.274091 -1.788315
H  1.302283 -3.749591 3.468924
H  -0.118541 -2.111697 -0.231002
H  -1.015996 -3.812231 4.325161
H  -2.418211 -2.137912 0.6428
H  -2.883124 -2.990941 2.920674
elementType: Cl F O N C H
totalener: -2149.93749992 hartree
nucrepener: 3050.92039377 hartree
electener: -5200.85789368 hartree
oneelecener: -9014.23743990 hartree
twoeener: 3813.37954621 hartree
cpcmener: -0.03515549 hartree
kineticenergy: 2143.46699924 hartree
xcener: -159.161127305214 hartree
chargesum: -0.0000000
charge: -0.062699 -0.060089 -0.206368 -0.262392 -0.431091 -0.323553 -0.080708 0.102666 0.079090 -0.112923 -0.253420 -0.266507 -0.222899 0.405498 0.056010 0.373249 -0.008996 -0.225261 -0.197547 -0.169999 0.191321 -0.157223 0.194966 0.276252 -0.238585 -0.176130 -0.121810 -0.143455 -0.175606 0.064249 0.102368 0.099616 0.061668 0.109359 0.090369 0.100956 0.099996 0.130193 0.131702 0.166489 0.148706 0.150907 0.148051 0.152457 0.158510 0.143940 0.158675
qa: -0.0627 -0.0601 -0.2064 -0.2624 -0.4311 -0.3236 -0.0807 0.1027 0.0791 -0.1129 -0.2534 -0.2665 -0.2229 0.4055 0.0560 0.3732 -0.0090 -0.2253 -0.1975 -0.1700 0.1913 -0.1572 0.1950 0.2763 -0.2386 -0.1761 -0.1218 -0.1435 -0.1756 0.0642 0.1024 0.0996 0.0617 0.1094 0.0904 0.1010 0.1000 0.1302 0.1317 0.1665 0.1487 0.1509 0.1481 0.1525 0.1585 0.1439 0.1587
va: 1.2706 1.2456 1.0869 2.1632 2.0736 2.0914 3.1077 3.7223 3.8291 3.8915 3.9218 3.9077 3.8880 4.1874 4.1862 3.7944 3.7433 4.0147 3.9272 3.9064 3.7611 3.8883 4.0688 3.7365 4.0092 3.8773 3.8868 3.8418 3.9300 1.0313 1.0279 1.0022 1.0102 1.0050 1.0058 1.0008 1.0011 1.0179 1.0195 0.9910 0.9998 0.9983 1.0064 0.9979 0.9885 1.0057 0.9901
dispcorr: -0.027474348 hartree
energy: -2149.964974266586
dipole: -6.69552 5.46554 -1.22999 10.81780 -10.81753 0.00027 24.03771 -24.90633 -0.86862
magnitude: 1.50578 au
magnitude: 3.82738 debye
