program: Orca
programVersion: 5.0.2
elementType: Cl Cl F O O O N C C C C C C C C C C C C C C C C C C C C C C H H H H H H H H H H H H H H H H H H
charge: 0
multiplicity: 1
keywords: wb97x-d3
keywords: def2-TZVPP
keywords: def2/J RIJCOSX
keywords: DEFGRID2
keywords: scfconv7
keywords: smallprint printgap noloewdin
keywords: NOSOSCF
formula: C22H18Cl2FNO3
InChI: InChI=1/C22H18Cl2FNO3/c1-22(2)15(11-19(23)24)20(22)21(27)29-18(12-26)13-8-9-16(25)17(10-13)28-14-6-4-3-5-7-14/h3-11,15,18,20H,1-2H3
47 atoms
Cl -3.014894 5.419595 -1.354262
Cl -4.851413 5.659776 0.857885
F  2.829867 -3.025806 -2.617947
O  0.681256 1.019341 1.658037
O  0.71522 2.158641 -0.263839
O  0.800836 -3.405434 -0.834701
N  2.868693 -0.26134 3.768863
C  -2.332271 1.201667 -0.071322
C  -2.18586 2.697725 -0.007466
C  -1.353029 1.828122 0.904565
C  -1.831339 0.501915 -1.310644
C  -3.539546 0.531186 0.537058
C  -3.220327 3.55438 0.584918
C  0.098004 1.722137 0.67174
C  -3.631593 4.715238 0.090752
C  2.055989 0.707727 1.482066
C  2.276673 -0.305109 0.38305
C  2.492102 0.16886 2.772658
C  1.45997 -1.428305 0.304506
C  3.288989 -0.113184 -0.543862
C  1.646411 -2.345851 -0.712631
C  3.491581 -1.037463 -1.558935
C  2.664275 -2.13517 -1.637296
C  1.288499 -4.677172 -0.678418
C  2.463423 -4.958984 0.005226
C  0.517681 -5.699699 -1.216521
C  2.869073 -6.281631 0.13329
C  0.933551 -7.014329 -1.07342
C  2.113199 -7.313293 -0.403047
H  -1.642932 3.128437 -0.841036
H  -1.650052 1.771985 1.946197
H  -2.644051 0.414261 -2.033828
H  -1.01547 1.025626 -1.805083
H  -1.49039 -0.508521 -1.075074
H  -4.390177 0.585337 -0.144921
H  -3.329244 -0.523944 0.72016
H  -3.842906 0.970074 1.486677
H  -3.687945 3.223922 1.504774
H  2.646593 1.609085 1.287048
H  0.66526 -1.600238 1.021081
H  3.921739 0.762932 -0.486824
H  4.272849 -0.895677 -2.294111
H  3.062635 -4.17104 0.444437
H  -0.398889 -5.464835 -1.743633
H  3.787197 -6.500395 0.663572
H  0.331871 -7.808834 -1.495954
H  2.43779 -8.340329 -0.298454
elementType: Cl F O N C H
totalener: -2149.93911914 hartree
nucrepener: 2890.99698257 hartree
electener: -5040.93610171 hartree
oneelecener: -8695.14414134 hartree
twoeener: 3654.20803964 hartree
cpcmener: -0.03302886 hartree
kineticenergy: 2143.45795172 hartree
xcener: -159.157778961948 hartree
chargesum: -0.0000000
charge: -0.055250 -0.059964 -0.206482 -0.279314 -0.425972 -0.328420 -0.086737 0.092052 0.028519 -0.065896 -0.267050 -0.264529 -0.204791 0.355036 0.040771 0.416565 0.007098 -0.228584 -0.213311 -0.153420 0.149265 -0.162614 0.266552 0.271807 -0.168572 -0.243357 -0.164018 -0.125636 -0.181895 0.079607 0.101830 0.104310 0.095600 0.095828 0.102596 0.098910 0.091140 0.130049 0.143454 0.141898 0.148509 0.153178 0.152251 0.144920 0.158844 0.157388 0.157838
qa: -0.0553 -0.0600 -0.2065 -0.2793 -0.4260 -0.3284 -0.0867 0.0921 0.0285 -0.0659 -0.2670 -0.2645 -0.2048 0.3550 0.0408 0.4166 0.0071 -0.2286 -0.2133 -0.1534 0.1493 -0.1626 0.2666 0.2718 -0.1686 -0.2434 -0.1640 -0.1256 -0.1819 0.0796 0.1018 0.1043 0.0956 0.0958 0.1026 0.0989 0.0911 0.1300 0.1435 0.1419 0.1485 0.1532 0.1523 0.1449 0.1588 0.1574 0.1578
va: 1.2702 1.2447 1.0865 2.1242 2.0861 2.0501 3.1107 3.7424 3.8813 3.8169 3.9026 3.9026 3.8990 4.2521 4.2121 3.7094 3.5955 4.0788 3.9845 3.9481 3.7428 3.9088 3.9969 3.6946 3.8669 3.9947 3.9162 3.9024 3.8992 1.0493 1.0305 1.0015 1.0156 1.0019 1.0008 1.0017 1.0053 1.0180 1.0145 1.0234 0.9999 0.9975 1.0035 1.0091 0.9909 0.9892 0.9902
dispcorr: -0.024625387 hartree
energy: -2149.963744522186
dipole: 5.62717 -5.91111 -0.28394 -32.92387 32.34898 -0.57488 0.93444 -1.32881 -0.39437
magnitude: 0.75275 au
magnitude: 1.91335 debye
