program: Orca
programVersion: 5.0.2
elementType: Cl Cl F O O O N C C C C C C C C C C C C C C C C C C C C C C H H H H H H H H H H H H H H H H H H
charge: 0
multiplicity: 1
keywords: wb97x-d3
keywords: def2-TZVPP
keywords: def2/J RIJCOSX
keywords: DEFGRID2
keywords: scfconv7
keywords: smallprint printgap noloewdin
keywords: NOSOSCF
formula: C22H18Cl2FNO3
InChI: InChI=1/C22H18Cl2FNO3/c1-22(2)15(11-19(23)24)20(22)21(27)29-18(12-26)13-8-9-16(25)17(10-13)28-14-6-4-3-5-7-14/h3-11,15,18,20H,1-2H3
47 atoms
Cl -3.056964 5.848579 0.559701
Cl -5.495953 4.630264 1.502226
F  4.338283 -2.247396 -2.715578
O  0.135839 0.317872 1.139398
O  0.722933 2.278988 0.240523
O  2.284451 -3.569976 -1.71225
N  1.398938 -1.548117 3.546625
C  -2.021048 1.920402 -1.252244
C  -2.180966 2.896847 -0.122772
C  -1.556076 1.539553 0.140868
C  -1.022525 2.254232 -2.333045
C  -3.222037 1.168661 -1.773102
C  -3.490631 3.186406 0.474376
C  -0.126504 1.462619 0.486988
C  -3.942207 4.392208 0.795704
C  1.491918 0.075644 1.501963
C  2.269172 -0.546156 0.36948
C  1.425254 -0.830039 2.651052
C  1.888124 -1.791754 -0.120038
C  3.338466 0.132596 -0.195118
C  2.597187 -2.372613 -1.157015
C  4.04177 -0.435712 -1.247781
C  3.668852 -1.678169 -1.710088
C  1.879056 -4.614707 -0.921091
C  0.91936 -5.462027 -1.455276
C  2.432417 -4.861715 0.32911
C  0.50888 -6.569415 -0.72742
C  2.00131 -5.966134 1.05037
C  1.040283 -6.822325 0.530158
H  -1.478529 3.722641 -0.140835
H  -2.180694 0.811619 0.646086
H  -1.532674 2.762099 -3.152446
H  -0.22237 2.908077 -1.996011
H  -0.571275 1.347529 -2.739577
H  -3.789014 1.791806 -2.466746
H  -2.90034 0.27833 -2.315373
H  -3.900045 0.841985 -0.985784
H  -4.149743 2.350782 0.677305
H  1.982288 0.994142 1.837247
H  1.043741 -2.318609 0.310292
H  3.631002 1.10377 0.181749
H  4.879152 0.07941 -1.70037
H  0.504311 -5.257952 -2.434893
H  3.192168 -4.210954 0.743826
H  -0.237692 -7.231453 -1.146948
H  2.428106 -6.157235 2.026783
H  0.71056 -7.681754 1.098905
elementType: Cl F O N C H
totalener: -2149.93946298 hartree
nucrepener: 2864.97914573 hartree
electener: -5014.91860871 hartree
oneelecener: -8643.09128655 hartree
twoeener: 3628.17267785 hartree
cpcmener: -0.03146389 hartree
kineticenergy: 2143.45921735 hartree
xcener: -159.158872726437 hartree
chargesum: -0.0000000
charge: -0.054344 -0.059576 -0.206138 -0.283763 -0.443857 -0.324880 -0.087996 0.088142 0.030605 -0.087064 -0.266418 -0.261455 -0.200680 0.396042 0.038876 0.422856 -0.002466 -0.232415 -0.184519 -0.163213 0.181959 -0.160327 0.196062 0.286987 -0.249799 -0.189816 -0.118726 -0.143748 -0.185688 0.082989 0.097921 0.098116 0.094964 0.100727 0.101218 0.099468 0.090156 0.130626 0.138467 0.150684 0.147822 0.151848 0.146838 0.156800 0.158227 0.160036 0.158454
qa: -0.0543 -0.0596 -0.2061 -0.2838 -0.4439 -0.3249 -0.0880 0.0881 0.0306 -0.0871 -0.2664 -0.2615 -0.2007 0.3960 0.0389 0.4229 -0.0025 -0.2324 -0.1845 -0.1632 0.1820 -0.1603 0.1961 0.2870 -0.2498 -0.1898 -0.1187 -0.1437 -0.1857 0.0830 0.0979 0.0981 0.0950 0.1007 0.1012 0.0995 0.0902 0.1306 0.1385 0.1507 0.1478 0.1518 0.1468 0.1568 0.1582 0.1600 0.1585
va: 1.2713 1.2451 1.0875 2.1332 2.0702 2.0869 3.1085 3.7293 3.8703 3.8625 3.9060 3.9080 3.8933 4.1911 4.2130 3.7292 3.6332 4.0767 3.9575 3.9104 3.7469 3.8876 4.0690 3.6944 4.0065 3.9002 3.8859 3.8949 3.9095 1.0458 1.0333 1.0007 1.0183 0.9989 1.0011 1.0016 1.0058 1.0175 1.0172 1.0107 1.0057 0.9976 1.0074 0.9966 0.9890 0.9900 0.9903
dispcorr: -0.023469184 hartree
energy: -2149.962932164330
dipole: 5.39421 -5.84960 -0.45539 -25.08357 24.82702 -0.25655 -11.01630 10.05164 -0.96466
magnitude: 1.09716 au
magnitude: 2.78877 debye
