program: Orca
programVersion: 5.0.2
elementType: Cl Cl F O O O N C C C C C C C C C C C C C C C C C C C C C C H H H H H H H H H H H H H H H H H H
charge: 0
multiplicity: 1
keywords: wb97x-d3
keywords: def2-TZVPP
keywords: def2/J RIJCOSX
keywords: DEFGRID2
keywords: scfconv7
keywords: smallprint printgap noloewdin
keywords: NOSOSCF
formula: C22H18Cl2FNO3
InChI: InChI=1/C22H18Cl2FNO3/c1-22(2)15(11-19(23)24)20(22)21(27)29-18(12-26)13-8-9-16(25)17(10-13)28-14-6-4-3-5-7-14/h3-11,15,18,20H,1-2H3
47 atoms
Cl -1.904874 0.172158 1.544305
Cl -4.51729 -0.63445 0.613475
F  4.562737 -3.159377 -1.137659
O  1.015243 1.7428 -0.252498
O  0.460378 3.645052 0.771069
O  2.118999 -3.189799 -0.148601
N  1.984944 1.696847 3.031551
C  -2.05195 3.643037 -1.122555
C  -2.390379 2.792951 0.051213
C  -1.09325 2.545037 -0.703451
C  -1.723711 5.097535 -0.892723
C  -2.761245 3.390436 -2.431311
C  -3.434338 1.745687 0.010847
C  0.172945 2.754681 0.012775
C  -3.305287 0.583744 0.635511
C  2.258136 1.688594 0.427907
C  2.912798 0.390732 0.026056
C  2.06708 1.713305 1.885649
C  2.189432 -0.790685 0.162018
C  4.198684 0.373895 -0.485298
C  2.742065 -1.990827 -0.244191
C  4.770521 -0.833357 -0.86989
C  4.037832 -1.991749 -0.754949
C  0.745883 -3.246479 -0.188597
C  0.108638 -3.980353 0.798459
C  0.024783 -2.638269 -1.208357
C  -1.273363 -4.110899 0.761488
C  -1.356249 -2.764344 -1.223558
C  -2.010002 -3.498685 -0.242028
H  -2.258731 3.26623 1.0214
H  -1.094547 1.670805 -1.34429
H  -0.991988 5.4538 -1.619948
H  -2.628716 5.695039 -1.018554
H  -1.336839 5.299914 0.103198
H  -3.720425 3.911198 -2.454393
H  -2.16334 3.762851 -3.264841
H  -2.95171 2.331926 -2.611896
H  -4.351822 1.933939 -0.535048
H  2.893311 2.538473 0.159663
H  1.188917 -0.775389 0.576789
H  4.761116 1.29213 -0.592856
H  5.774285 -0.868482 -1.272927
H  0.688533 -4.448744 1.583862
H  0.528291 -2.073224 -1.983251
H  -1.773012 -4.689218 1.527856
H  -1.922868 -2.286909 -2.012607
H  -3.087078 -3.596435 -0.263198
elementType: Cl F O N C H
totalener: -2149.93517465 hartree
nucrepener: 3098.71020738 hartree
electener: -5248.64538202 hartree
oneelecener: -9111.25027081 hartree
twoeener: 3862.60488878 hartree
cpcmener: -0.03466914 hartree
kineticenergy: 2143.47857853 hartree
xcener: -159.163014882778 hartree
chargesum: -0.0000000
charge: -0.054707 -0.055987 -0.207502 -0.270218 -0.437811 -0.323035 -0.084196 0.146531 -0.043012 -0.135568 -0.274583 -0.282033 -0.205368 0.392119 0.085869 0.422612 -0.009573 -0.241860 -0.172383 -0.181170 0.190926 -0.148910 0.185058 0.269963 -0.231558 -0.180356 -0.119761 -0.145362 -0.185354 0.121684 0.107583 0.100809 0.094679 0.095906 0.102583 0.099613 0.093380 0.141781 0.131663 0.133525 0.148599 0.150870 0.147629 0.157027 0.157869 0.157671 0.154357
qa: -0.0547 -0.0560 -0.2075 -0.2702 -0.4378 -0.3230 -0.0842 0.1465 -0.0430 -0.1356 -0.2746 -0.2820 -0.2054 0.3921 0.0859 0.4226 -0.0096 -0.2419 -0.1724 -0.1812 0.1909 -0.1489 0.1851 0.2700 -0.2316 -0.1804 -0.1198 -0.1454 -0.1854 0.1217 0.1076 0.1008 0.0947 0.0959 0.1026 0.0996 0.0934 0.1418 0.1317 0.1335 0.1486 0.1509 0.1476 0.1570 0.1579 0.1577 0.1544
va: 1.2838 1.2509 1.0850 2.1518 2.0636 2.0846 3.1119 3.7167 3.8881 3.8595 3.8848 3.9158 3.9077 4.1557 4.1554 3.7654 3.7398 4.0319 3.9387 3.9071 3.7552 3.8824 4.0627 3.6898 4.0146 3.9211 3.8849 3.8444 3.8801 1.0180 1.0228 0.9993 1.0011 1.0188 0.9992 1.0030 0.9996 1.0071 1.0132 1.0214 1.0010 0.9981 1.0058 0.9950 0.9893 0.9914 0.9968
dispcorr: -0.028040771 hartree
energy: -2149.963215419667
dipole: -6.90668 5.92676 -0.97993 20.51335 -19.61677 0.89659 -15.62905 12.85849 -2.77055
magnitude: 3.07247 au
magnitude: 7.80960 debye
