program: Orca
programVersion: 5.0.2
elementType: Cl Cl F O O O N C C C C C C C C C C C C C C C C C C C C C C H H H H H H H H H H H H H H H H H H
charge: 0
multiplicity: 1
keywords: wb97x-d3
keywords: def2-TZVPP
keywords: def2/J RIJCOSX
keywords: DEFGRID2
keywords: scfconv7
keywords: smallprint printgap noloewdin
keywords: NOSOSCF
formula: C22H18Cl2FNO3
InChI: InChI=1/C22H18Cl2FNO3/c1-22(2)15(11-19(23)24)20(22)21(27)29-18(12-26)13-8-9-16(25)17(10-13)28-14-6-4-3-5-7-14/h3-11,15,18,20H,1-2H3
47 atoms
Cl -3.234283 5.637174 1.817253
Cl -5.786481 4.343221 1.453368
F  4.670936 -2.177826 -2.462225
O  -0.090824 0.246644 0.769787
O  0.66001 2.355015 0.845745
O  2.439746 -3.550941 -1.993782
N  0.371821 -2.076976 3.077244
C  -1.615672 2.839186 -1.255473
C  -2.097236 3.250854 0.104211
C  -1.490696 1.872211 -0.09347
C  -0.406518 3.546518 -1.815927
C  -2.615857 2.455603 -2.31967
C  -3.526053 3.344203 0.425889
C  -0.199209 1.567919 0.54517
C  -4.093301 4.310093 1.137105
C  1.104629 -0.227927 1.383219
C  2.067826 -0.759915 0.354548
C  0.682126 -1.267117 2.324418
C  1.785663 -1.941269 -0.322097
C  3.217767 -0.043163 0.055851
C  2.6682 -2.421707 -1.274263
C  4.099152 -0.511508 -0.907164
C  3.821413 -1.697583 -1.551079
C  2.099522 -4.710701 -1.345421
C  2.601292 -5.040008 -0.092906
C  1.257602 -5.578616 -2.025925
C  2.241263 -6.251927 0.479972
C  0.915531 -6.790257 -1.443666
C  1.398985 -7.130357 -0.187165
H  -1.452548 3.958658 0.61286
H  -2.186922 1.041647 -0.115634
H  -0.734026 4.395714 -2.418223
H  0.263441 3.931711 -1.051266
H  0.16577 2.883385 -2.467329
H  -3.036155 3.347929 -2.78719
H  -2.127582 1.870795 -3.101203
H  -3.442338 1.857862 -1.937507
H  -4.180298 2.563967 0.055679
H  1.585428 0.559219 1.971455
H  0.882252 -2.501487 -0.106804
H  3.435107 0.881698 0.573596
H  5.00285 0.033793 -1.144502
H  3.268743 -4.371413 0.436159
H  0.876975 -5.307738 -3.002843
H  2.631437 -6.508814 1.456209
H  0.2588 -7.466686 -1.975185
H  1.124728 -8.073297 0.26709
elementType: Cl F O N C H
totalener: -2149.93915348 hartree
nucrepener: 2837.63519648 hartree
electener: -4987.57434996 hartree
oneelecener: -8588.35479701 hartree
twoeener: 3600.78044705 hartree
cpcmener: -0.03132997 hartree
kineticenergy: 2143.46426405 hartree
xcener: -159.158949128591 hartree
chargesum: 0.0000000
charge: -0.054721 -0.059076 -0.205579 -0.283564 -0.446760 -0.327140 -0.088465 0.089565 0.033443 -0.097907 -0.268518 -0.262741 -0.201570 0.410062 0.040338 0.415971 -0.003298 -0.229616 -0.160883 -0.143685 0.146606 -0.173244 0.215347 0.265444 -0.167937 -0.238894 -0.153265 -0.123649 -0.182325 0.082450 0.096999 0.098464 0.095001 0.099976 0.101527 0.098909 0.091666 0.130175 0.133268 0.150215 0.148458 0.151651 0.154570 0.147093 0.159578 0.157830 0.158231
qa: -0.0547 -0.0591 -0.2056 -0.2836 -0.4468 -0.3271 -0.0885 0.0896 0.0334 -0.0979 -0.2685 -0.2627 -0.2016 0.4101 0.0403 0.4160 -0.0033 -0.2296 -0.1609 -0.1437 0.1466 -0.1732 0.2153 0.2654 -0.1679 -0.2389 -0.1533 -0.1236 -0.1823 0.0824 0.0970 0.0985 0.0950 0.1000 0.1015 0.0989 0.0917 0.1302 0.1333 0.1502 0.1485 0.1517 0.1546 0.1471 0.1596 0.1578 0.1582
va: 1.2709 1.2458 1.0888 2.1319 2.0655 2.0800 3.1072 3.7262 3.8641 3.8669 3.9059 3.9088 3.8979 4.1778 4.2130 3.7208 3.6677 4.0814 3.9731 3.8884 3.7658 3.8953 4.0685 3.7068 3.8771 3.9978 3.9040 3.8942 3.9041 1.0466 1.0337 1.0001 1.0188 0.9994 1.0007 1.0017 1.0056 1.0182 1.0234 1.0087 1.0058 0.9980 0.9986 1.0070 0.9905 0.9890 0.9902
dispcorr: -0.023047247 hartree
energy: -2149.962200725760
dipole: 10.27006 -10.18443 0.08563 -18.08724 18.29182 0.20458 -15.84116 14.48263 -1.35853
magnitude: 1.37651 au
magnitude: 3.49881 debye
