program: Orca
programVersion: 5.0.2
elementType: Cl Cl F O O O N C C C C C C C C C C C C C C C C C C C C C C H H H H H H H H H H H H H H H H H H
charge: 0
multiplicity: 1
keywords: wb97x-d3
keywords: def2-TZVPP
keywords: def2/J RIJCOSX
keywords: DEFGRID2
keywords: scfconv7
keywords: smallprint printgap noloewdin
keywords: NOSOSCF
formula: C22H18Cl2FNO3
InChI: InChI=1/C22H18Cl2FNO3/c1-22(2)15(11-19(23)24)20(22)21(27)29-18(12-26)13-8-9-16(25)17(10-13)28-14-6-4-3-5-7-14/h3-11,15,18,20H,1-2H3
47 atoms
Cl -3.194372 5.622614 -0.140067
Cl -5.467196 4.561856 1.287109
F  4.405548 -2.276983 -2.607706
O  0.35408 0.453506 1.333415
O  0.750627 2.21062 0.01117
O  2.25278 -3.419028 -1.592641
N  1.98802 -1.097798 3.748128
C  -2.093616 1.420278 -1.102223
C  -2.205471 2.626297 -0.214486
C  -1.486576 1.389234 0.288402
C  -1.215185 1.526328 -2.324864
C  -3.293292 0.529001 -1.31686
C  -3.472376 2.999251 0.427606
C  -0.029225 1.432416 0.495175
C  -3.965239 4.228396 0.511358
C  1.750326 0.326839 1.570667
C  2.462422 -0.364968 0.4343
C  1.862793 -0.466109 2.797468
C  1.994137 -1.593743 -0.021559
C  3.572219 0.225479 -0.147601
C  2.654628 -2.243331 -1.050754
C  4.234149 -0.417584 -1.184097
C  3.774664 -1.640453 -1.616825
C  1.698682 -4.398178 -0.807102
C  0.623166 -5.092961 -1.339733
C  2.220357 -4.732433 0.435919
C  0.065654 -6.139654 -0.61936
C  1.644578 -5.77422 1.149084
C  0.568568 -6.480724 0.62845
H  -1.555454 3.449059 -0.49057
H  -2.022874 0.77734 1.00494
H  -1.824887 1.813803 -3.18343
H  -0.424522 2.266844 -2.227545
H  -0.753658 0.564548 -2.557284
H  -2.973954 -0.447293 -1.685579
H  -3.871344 0.358379 -0.409494
H  -3.961425 0.962186 -2.063634
H  -4.06235 2.208501 0.875834
H  2.209601 1.301091 1.766942
H  1.117553 -2.0484 0.425613
H  3.929122 1.185129 0.202188
H  5.103869 0.026769 -1.650145
H  0.232288 -4.821429 -2.312367
H  3.067447 -4.197331 0.847012
H  -0.770883 -6.6850 -1.0369
H  2.047946 -6.035809 2.118836
H  0.128055 -7.293515 1.190582
elementType: Cl F O N C H
totalener: -2149.93948732 hartree
nucrepener: 2885.92332927 hartree
electener: -5035.86281659 hartree
oneelecener: -8684.93341350 hartree
twoeener: 3649.07059691 hartree
cpcmener: -0.03209627 hartree
kineticenergy: 2143.45399556 hartree
xcener: -159.157824745022 hartree
chargesum: 0.0000000
charge: -0.054568 -0.059361 -0.207072 -0.286248 -0.437591 -0.323809 -0.087473 0.086765 0.036697 -0.080777 -0.266065 -0.262538 -0.203861 0.381091 0.038605 0.421131 0.002974 -0.231169 -0.188201 -0.173929 0.187232 -0.155141 0.193637 0.279853 -0.246995 -0.188132 -0.118981 -0.142485 -0.183126 0.082480 0.098352 0.099430 0.095332 0.100184 0.098665 0.090624 0.102329 0.130179 0.141654 0.149950 0.147311 0.151399 0.146915 0.157558 0.158423 0.160179 0.158574
qa: -0.0546 -0.0594 -0.2071 -0.2862 -0.4376 -0.3238 -0.0875 0.0868 0.0367 -0.0808 -0.2661 -0.2625 -0.2039 0.3811 0.0386 0.4211 0.0030 -0.2312 -0.1882 -0.1739 0.1872 -0.1551 0.1936 0.2799 -0.2470 -0.1881 -0.1190 -0.1425 -0.1831 0.0825 0.0984 0.0994 0.0953 0.1002 0.0987 0.0906 0.1023 0.1302 0.1417 0.1499 0.1473 0.1514 0.1469 0.1576 0.1584 0.1602 0.1586
va: 1.2710 1.2454 1.0857 2.1274 2.0767 2.0846 3.1104 3.7369 3.8703 3.8497 3.9058 3.9077 3.8919 4.2080 4.2139 3.7213 3.6331 4.0798 3.9303 3.9273 3.7407 3.8817 4.0614 3.6985 4.0103 3.9128 3.8838 3.8925 3.9083 1.0460 1.0331 1.0005 1.0177 0.9992 1.0017 1.0055 1.0007 1.0179 1.0167 1.0147 1.0025 0.9977 1.0074 0.9966 0.9890 0.9899 0.9904
dispcorr: -0.023709223 hartree
energy: -2149.963196542328
dipole: 3.78857 -4.47669 -0.68812 -27.21635 26.74891 -0.46744 -7.54812 6.82682 -0.72129
magnitude: 1.10104 au
magnitude: 2.79862 debye
