program: Orca
programVersion: 5.0.2
elementType: Cl Cl F O O O N C C C C C C C C C C C C C C C C C C C C C C H H H H H H H H H H H H H H H H H H
charge: 0
multiplicity: 1
keywords: wb97x-d3
keywords: def2-TZVPP
keywords: def2/J RIJCOSX
keywords: DEFGRID2
keywords: scfconv7
keywords: smallprint printgap noloewdin
keywords: NOSOSCF
formula: C22H18Cl2FNO3
InChI: InChI=1/C22H18Cl2FNO3/c1-22(2)15(11-19(23)24)20(22)21(27)29-18(12-26)13-8-9-16(25)17(10-13)28-14-6-4-3-5-7-14/h3-11,15,18,20H,1-2H3
47 atoms
Cl -0.570483 0.726297 -2.574901
Cl -2.328043 1.976748 -4.502401
F  2.320358 -2.925775 -2.086049
O  1.06108 2.35532 0.858152
O  -0.427085 0.858038 1.57981
O  1.817951 -3.355581 0.481642
N  2.049233 1.073278 3.869208
C  -2.556934 2.97861 0.646428
C  -2.333684 1.9802 -0.43118
C  -1.135502 2.679274 0.191891
C  -3.059321 2.498899 1.98476
C  -3.06109 4.352059 0.276067
C  -2.653627 2.239372 -1.8509
C  -0.186434 1.858753 0.955008
C  -1.950417 1.716413 -2.845549
C  2.132256 1.529236 1.296008
C  2.249007 0.288712 0.440428
C  2.045909 1.25722 2.734988
C  2.004331 -0.985001 0.933174
C  2.551172 0.470517 -0.903995
C  2.026714 -2.077037 0.078771
C  2.587987 -0.61664 -1.760874
C  2.311082 -1.872336 -1.265246
C  0.922398 -3.624048 1.486432
C  1.284604 -4.600762 2.40136
C  -0.314377 -2.996232 1.565024
C  0.395985 -4.955554 3.406155
C  -1.186586 -3.353031 2.583395
C  -0.838712 -4.330406 3.506112
H  -2.441014 0.941362 -0.128644
H  -0.676333 3.456447 -0.407728
H  -2.798759 1.464687 2.196886
H  -2.6722 3.120128 2.793841
H  -4.148225 2.571721 2.007384
H  -2.795022 5.074749 1.048816
H  -2.649827 4.715095 -0.666079
H  -4.14913 4.350599 0.187208
H  -3.507217 2.859637 -2.098305
H  3.020711 2.150188 1.157723
H  1.781893 -1.138462 1.981982
H  2.752626 1.459558 -1.294935
H  2.816442 -0.490186 -2.811222
H  2.250923 -5.082689 2.322991
H  -0.602589 -2.237673 0.847856
H  0.677932 -5.72051 4.117889
H  -2.147849 -2.860489 2.650248
H  -1.525693 -4.602841 4.296422
elementType: Cl F O N C H
totalener: -2149.93437179 hartree
nucrepener: 3091.20950892 hartree
electener: -5241.14388070 hartree
oneelecener: -9096.64617860 hartree
twoeener: 3855.50229790 hartree
cpcmener: -0.03240792 hartree
kineticenergy: 2143.48761521 hartree
xcener: -159.167101150884 hartree
chargesum: -0.0000000
charge: -0.052601 -0.054731 -0.207068 -0.282179 -0.445283 -0.324282 -0.080085 0.139286 -0.057108 -0.094274 -0.270692 -0.281575 -0.208860 0.391353 0.076782 0.471371 -0.004517 -0.251488 -0.151791 -0.280393 0.204063 -0.178062 0.216202 0.280138 -0.243694 -0.182214 -0.121308 -0.142975 -0.180172 0.121741 0.106258 0.095288 0.101646 0.095992 0.099546 0.092997 0.102817 0.140535 0.144500 0.143848 0.146264 0.156614 0.146412 0.148109 0.157588 0.158330 0.157673
qa: -0.0526 -0.0547 -0.2071 -0.2822 -0.4453 -0.3243 -0.0801 0.1393 -0.0571 -0.0943 -0.2707 -0.2816 -0.2089 0.3914 0.0768 0.4714 -0.0045 -0.2515 -0.1518 -0.2804 0.2041 -0.1781 0.2162 0.2801 -0.2437 -0.1822 -0.1213 -0.1430 -0.1802 0.1217 0.1063 0.0953 0.1016 0.0960 0.0995 0.0930 0.1028 0.1405 0.1445 0.1438 0.1463 0.1566 0.1464 0.1481 0.1576 0.1583 0.1577
va: 1.2959 1.2525 1.0864 2.1231 2.0528 2.0910 3.1056 3.7317 3.8947 3.8403 3.8881 3.9120 3.8959 4.1207 4.1888 3.8487 3.6381 4.0780 3.8788 3.9220 3.7609 3.8069 4.0448 3.6984 4.0085 3.8999 3.8833 3.8940 3.9074 1.0165 1.0268 1.0181 0.9991 1.0011 1.0028 0.9996 0.9990 1.0078 0.9917 1.0122 1.0093 0.9962 1.0072 1.0077 0.9891 0.9907 0.9904
dispcorr: -0.027606543 hartree
energy: -2149.961978328139
dipole: -14.20475 13.35307 -0.85168 8.61084 -6.55438 2.05645 28.14326 -29.15976 -1.01651
magnitude: 2.44697 au
magnitude: 6.21969 debye
