program: Orca
programVersion: 5.0.2
elementType: Cl Cl F O O O N C C C C C C C C C C C C C C C C C C C C C C H H H H H H H H H H H H H H H H H H
charge: 0
multiplicity: 1
keywords: wb97x-d3
keywords: def2-TZVPP
keywords: def2/J RIJCOSX
keywords: DEFGRID2
keywords: scfconv7
keywords: smallprint printgap noloewdin
keywords: NOSOSCF
formula: C22H18Cl2FNO3
InChI: InChI=1/C22H18Cl2FNO3/c1-22(2)15(11-19(23)24)20(22)21(27)29-18(12-26)13-8-9-16(25)17(10-13)28-14-6-4-3-5-7-14/h3-11,15,18,20H,1-2H3
47 atoms
Cl -2.556048 -0.758528 -2.079736
Cl -4.192226 0.921835 -3.757039
F  3.742488 -3.356639 -0.978713
O  0.98158 1.98457 0.040814
O  1.057556 4.204374 0.238557
O  2.133709 -2.968693 1.087694
N  2.774991 2.462908 2.866655
C  -2.062961 2.718793 0.63048
C  -1.783176 1.926802 -0.622037
C  -1.00531 3.192531 -0.343804
C  -1.653817 2.106322 1.948191
C  -3.310459 3.561734 0.728393
C  -2.719398 1.916545 -1.753333
C  0.429739 3.203516 0.006036
C  -3.099697 0.838953 -2.428116
C  2.367811 1.892433 0.345375
C  2.790122 0.483257 0.030343
C  2.590808 2.22294 1.758667
C  2.26462 -0.575942 0.762831
C  3.6471 0.245422 -1.032893
C  2.579074 -1.878179 0.416534
C  3.984562 -1.05684 -1.371492
C  3.440157 -2.097963 -0.654605
C  0.856781 -2.997308 1.589959
C  0.680957 -3.634812 2.809027
C  -0.226581 -2.469216 0.89887
C  -0.595797 -3.745704 3.340911
C  -1.49493 -2.574003 1.451678
C  -1.687008 -3.211421 2.670047
H  -1.250405 0.998428 -0.453759
H  -1.281041 4.07246 -0.916055
H  -2.494211 1.556506 2.376387
H  -0.824215 1.40586 1.861077
H  -1.36894 2.880532 2.663848
H  -3.560767 4.064177 -0.205372
H  -4.164796 2.947107 1.01811
H  -3.185022 4.334368 1.489039
H  -3.13393 2.864172 -2.077325
H  2.947639 2.599759 -0.254883
H  1.604592 -0.390922 1.602714
H  4.053745 1.069391 -1.604503
H  4.652342 -1.262447 -2.197767
H  1.535625 -4.043806 3.333331
H  -0.094485 -1.983747 -0.060089
H  -0.732487 -4.246649 4.290674
H  -2.339702 -2.159125 0.916801
H  -2.680185 -3.29365 3.091487
elementType: Cl F O N C H
totalener: -2149.93757894 hartree
nucrepener: 3033.24475714 hartree
electener: -5183.18233608 hartree
oneelecener: -8978.94547736 hartree
twoeener: 3795.76314128 hartree
cpcmener: -0.03502232 hartree
kineticenergy: 2143.45983689 hartree
xcener: -159.158605469473 hartree
chargesum: -0.0000000
charge: -0.062788 -0.060245 -0.205531 -0.258780 -0.431210 -0.323370 -0.080657 0.086959 0.077997 -0.110856 -0.253545 -0.265932 -0.218147 0.404354 0.048542 0.379148 -0.000902 -0.227851 -0.194902 -0.167354 0.191289 -0.159935 0.195386 0.286557 -0.250445 -0.179130 -0.117113 -0.132384 -0.186388 0.068981 0.104010 0.099380 0.077839 0.105705 0.089591 0.100661 0.100081 0.130887 0.129728 0.155361 0.149486 0.151702 0.146505 0.148243 0.158073 0.142427 0.158575
qa: -0.0628 -0.0602 -0.2055 -0.2588 -0.4312 -0.3234 -0.0807 0.0870 0.0780 -0.1109 -0.2535 -0.2659 -0.2181 0.4044 0.0485 0.3791 -0.0009 -0.2279 -0.1949 -0.1674 0.1913 -0.1599 0.1954 0.2866 -0.2504 -0.1791 -0.1171 -0.1324 -0.1864 0.0690 0.1040 0.0994 0.0778 0.1057 0.0896 0.1007 0.1001 0.1309 0.1297 0.1554 0.1495 0.1517 0.1465 0.1482 0.1581 0.1424 0.1586
va: 1.2731 1.2453 1.0882 2.1659 2.0736 2.0910 3.1063 3.7446 3.8344 3.8818 3.9124 3.9032 3.8772 4.1830 4.1876 3.7804 3.7320 4.0194 3.9507 3.9068 3.7581 3.8860 4.0729 3.7370 4.0061 3.8783 3.8861 3.8571 3.9397 1.0269 1.0273 1.0020 1.0101 1.0030 1.0054 1.0012 1.0011 1.0162 1.0199 1.0014 0.9989 0.9980 1.0076 1.0012 0.9886 1.0063 0.9902
dispcorr: -0.026523996 hartree
energy: -2149.964102936565
dipole: -5.79714 4.68767 -1.10947 12.42053 -12.24359 0.17695 23.16722 -24.17636 -1.00915
magnitude: 1.51017 au
magnitude: 3.83854 debye
