program: Orca
programVersion: 5.0.2
elementType: Cl Cl F O O O N C C C C C C C C C C C C C C C C C C C C C C H H H H H H H H H H H H H H H H H H
charge: 0
multiplicity: 1
keywords: wb97x-d3
keywords: def2-TZVPP
keywords: def2/J RIJCOSX
keywords: DEFGRID2
keywords: scfconv7
keywords: smallprint printgap noloewdin
keywords: NOSOSCF
formula: C22H18Cl2FNO3
InChI: InChI=1/C22H18Cl2FNO3/c1-22(2)15(11-19(23)24)20(22)21(27)29-18(12-26)13-8-9-16(25)17(10-13)28-14-6-4-3-5-7-14/h3-11,15,18,20H,1-2H3
47 atoms
Cl -0.406026 0.360958 -2.419091
Cl -2.280027 1.093695 -4.495885
F  2.523254 -2.991598 -1.774856
O  1.132132 2.500339 0.631717
O  -0.304326 1.111076 1.626585
O  1.727406 -3.133243 0.754405
N  2.237494 1.602199 3.751475
C  -2.49939 3.006216 0.376458
C  -2.273317 1.818316 -0.488325
C  -1.080884 2.646513 -0.041329
C  -2.962762 2.795831 1.796244
C  -3.037432 4.270435 -0.248055
C  -2.619426 1.786458 -1.925391
C  -0.09866 1.99758 0.837255
C  -1.872748 1.162134 -2.825223
C  2.244182 1.775003 1.143906
C  2.400352 0.455442 0.427139
C  2.196673 1.658789 2.605318
C  2.032076 -0.751991 1.003019
C  2.844632 0.490229 -0.890118
C  2.070165 -1.918514 0.254804
C  2.905201 -0.674835 -1.637352
C  2.501215 -1.861988 -1.062999
C  0.628206 -3.230875 1.570934
C  0.722196 -4.094819 2.650814
C  -0.545641 -2.533624 1.312906
C  -0.375635 -4.265078 3.482141
C  -1.629793 -2.704358 2.161219
C  -1.551538 -3.566766 3.24672
H  -2.355434 0.857284 0.014367
H  -0.649665 3.300564 -0.790217
H  -2.665442 1.833904 2.207332
H  -2.577968 3.578512 2.451869
H  -4.052458 2.843972 1.833139
H  -4.127301 4.234454 -0.304146
H  -2.766569 5.139104 0.354751
H  -2.65644 4.43883 -1.256122
H  -3.529733 2.269016 -2.262946
H  3.102822 2.412514 0.9207
H  1.700566 -0.798097 2.032715
H  3.141208 1.426964 -1.344503
H  3.247111 -0.659891 -2.663974
H  1.645369 -4.629535 2.836352
H  -0.624642 -1.866783 0.463028
H  -0.302387 -4.940264 4.324951
H  -2.543931 -2.158695 1.965052
H  -2.401512 -3.694213 3.903895
elementType: Cl F O N C H
totalener: -2149.93397225 hartree
nucrepener: 3134.46412544 hartree
electener: -5284.39809770 hartree
oneelecener: -9183.08967562 hartree
twoeener: 3898.69157792 hartree
cpcmener: -0.03313129 hartree
kineticenergy: 2143.48439978 hartree
xcener: -159.166088516843 hartree
chargesum: -0.0000000
charge: -0.056850 -0.056192 -0.205766 -0.279916 -0.444716 -0.328697 -0.079856 0.134399 -0.052344 -0.087155 -0.269269 -0.279819 -0.220260 0.379165 0.092297 0.461045 -0.018315 -0.247051 -0.129392 -0.247635 0.176495 -0.178804 0.219051 0.276930 -0.234936 -0.176393 -0.127054 -0.150690 -0.173718 0.119296 0.109376 0.093461 0.101172 0.096180 0.102674 0.100198 0.093460 0.141101 0.144787 0.143690 0.143500 0.153062 0.146580 0.143998 0.157439 0.157785 0.157689
qa: -0.0568 -0.0562 -0.2058 -0.2799 -0.4447 -0.3287 -0.0799 0.1344 -0.0523 -0.0872 -0.2693 -0.2798 -0.2203 0.3792 0.0923 0.4610 -0.0183 -0.2471 -0.1294 -0.2476 0.1765 -0.1788 0.2191 0.2769 -0.2349 -0.1764 -0.1271 -0.1507 -0.1737 0.1193 0.1094 0.0935 0.1012 0.0962 0.1027 0.1002 0.0935 0.1411 0.1448 0.1437 0.1435 0.1531 0.1466 0.1440 0.1574 0.1578 0.1577
va: 1.2968 1.2505 1.0880 2.1259 2.0486 2.0873 3.1074 3.7348 3.8882 3.8245 3.8920 3.9093 3.9028 4.1370 4.1729 3.8591 3.6197 4.0692 3.8914 3.9340 3.7678 3.8310 4.0460 3.6948 3.9983 3.8824 3.8898 3.8999 3.9022 1.0167 1.0256 1.0181 0.9992 1.0012 0.9992 1.0029 0.9994 1.0081 0.9920 1.0166 1.0063 0.9974 1.0068 1.0040 0.9891 0.9903 0.9902
dispcorr: -0.028763824 hartree
energy: -2149.962736078643
dipole: -16.15484 15.17719 -0.97765 13.04196 -11.11643 1.92553 24.71321 -26.13906 -1.42585
magnitude: 2.58777 au
magnitude: 6.57758 debye
