program: Orca
programVersion: 5.0.2
elementType: Cl Cl F O O O N C C C C C C C C C C C C C C C C C C C C C C H H H H H H H H H H H H H H H H H H
charge: 0
multiplicity: 1
keywords: wb97x-d3
keywords: def2-TZVPP
keywords: def2/J RIJCOSX
keywords: DEFGRID2
keywords: scfconv7
keywords: smallprint printgap noloewdin
keywords: NOSOSCF
formula: C22H18Cl2FNO3
InChI: InChI=1/C22H18Cl2FNO3/c1-22(2)15(11-19(23)24)20(22)21(27)29-18(12-26)13-8-9-16(25)17(10-13)28-14-6-4-3-5-7-14/h3-11,15,18,20H,1-2H3
47 atoms
Cl -2.249829 -0.631251 2.58538
Cl -4.50323 -1.16209 0.867161
F  3.387454 -2.840915 1.67748
O  1.180585 2.071051 -1.384827
O  1.136815 2.512401 0.80198
O  1.805135 -2.929392 -0.43417
N  3.882991 3.968798 -0.585015
C  -1.843547 3.304891 0.263764
C  -1.800748 1.887167 0.741888
C  -0.91705 2.322021 -0.424221
C  -1.306453 4.371752 1.185221
C  -3.002544 3.786902 -0.575104
C  -2.89262 0.940866 0.486405
C  0.538934 2.32396 -0.227333
C  -3.166727 -0.13218 1.217397
C  2.579156 1.82146 -1.311627
C  2.884232 0.586717 -0.494529
C  3.299633 3.018184 -0.867941
C  2.23712 -0.583712 -0.879733
C  3.728078 0.588841 0.603725
C  2.393218 -1.740834 -0.137296
C  3.918895 -0.578846 1.330413
C  3.240031 -1.718233 0.966622
C  0.609682 -2.951955 -1.119327
C  -0.460139 -2.142187 -0.758556
C  0.498585 -3.864051 -2.157546
C  -1.64735 -2.244229 -1.469326
C  -0.702109 -3.966944 -2.846977
C  -1.775028 -3.1528 -2.512467
H  -1.26342 1.742668 1.672091
H  -1.237703 2.001849 -1.408449
H  -0.580662 3.999454 1.903051
H  -0.844184 5.18058 0.617505
H  -2.13327 4.800059 1.752574
H  -2.722351 4.699666 -1.102249
H  -3.319494 3.064843 -1.325768
H  -3.861436 4.018372 0.056397
H  -3.538726 1.126253 -0.363063
H  2.876895 1.655457 -2.34956
H  1.598667 -0.586567 -1.75464
H  4.240056 1.488996 0.917054
H  4.572084 -0.593468 2.193148
H  -0.37512 -1.437144 0.059962
H  1.342281 -4.489718 -2.420827
H  -2.480059 -1.607613 -1.202986
H  -0.791007 -4.681453 -3.65524
H  -2.706463 -3.225765 -3.057799
elementType: Cl F O N C H
totalener: -2149.92360086 hartree
nucrepener: 3098.58053701 hartree
electener: -5248.50413787 hartree
oneelecener: -9110.30500928 hartree
twoeener: 3861.80087141 hartree
cpcmener: -0.04005119 hartree
kineticenergy: 2143.44375791 hartree
xcener: -159.162617842064 hartree
chargesum: 0.0000000
charge: -0.059081 -0.061910 -0.211990 -0.290682 -0.462619 -0.333647 -0.092489 0.092112 0.036975 -0.059486 -0.272067 -0.278049 -0.197854 0.413789 0.033308 0.501744 -0.051787 -0.249095 -0.240420 -0.174915 0.231784 -0.154787 0.190269 0.285964 -0.184422 -0.248991 -0.112185 -0.118873 -0.203476 0.084869 0.100573 0.093443 0.103282 0.099631 0.100705 0.095086 0.104761 0.134779 0.148082 0.149654 0.137929 0.153910 0.144277 0.149064 0.151026 0.161546 0.160263
qa: -0.0591 -0.0619 -0.2120 -0.2907 -0.4626 -0.3336 -0.0925 0.0921 0.0370 -0.0595 -0.2721 -0.2780 -0.1979 0.4138 0.0333 0.5017 -0.0518 -0.2491 -0.2404 -0.1749 0.2318 -0.1548 0.1903 0.2860 -0.1844 -0.2490 -0.1122 -0.1189 -0.2035 0.0849 0.1006 0.0934 0.1033 0.0996 0.1007 0.0951 0.1048 0.1348 0.1481 0.1497 0.1379 0.1539 0.1443 0.1491 0.1510 0.1615 0.1603
va: 1.2625 1.2418 1.0777 2.1251 2.0442 2.0807 3.1057 3.7914 3.8436 3.8302 3.9002 3.9118 3.8570 4.1258 4.1933 3.8221 3.7576 4.0816 3.9500 3.8785 3.7020 3.9092 4.0533 3.7450 3.9246 4.0079 3.8180 3.8772 3.9707 1.0464 1.0329 1.0189 0.9991 0.9997 1.0006 1.0054 0.9994 1.0183 0.9907 1.0094 1.0143 0.9970 1.0007 1.0060 1.0084 0.9871 0.9914
dispcorr: -0.028061282 hartree
energy: -2149.951662142568
dipole: -4.85977 3.01310 -1.84667 21.04821 -20.96160 0.08661 -15.46810 13.24869 -2.21940
magnitude: 2.88850 au
magnitude: 7.34198 debye
