program: Orca
programVersion: 5.0.2
elementType: Cl Cl F O O O N C C C C C C C C C C C C C C C C C C C C C C H H H H H H H H H H H H H H H H H H
charge: 0
multiplicity: 1
keywords: wb97x-d3
keywords: def2-TZVPP
keywords: def2/J RIJCOSX
keywords: DEFGRID2
keywords: scfconv7
keywords: smallprint printgap noloewdin
keywords: NOSOSCF
formula: C22H18Cl2FNO3
InChI: InChI=1/C22H18Cl2FNO3/c1-22(2)15(11-19(23)24)20(22)21(27)29-18(12-26)13-8-9-16(25)17(10-13)28-14-6-4-3-5-7-14/h3-11,15,18,20H,1-2H3
47 atoms
Cl -2.433639 6.182151 0.113653
Cl -4.652755 5.693353 1.890478
F  2.757078 -2.982252 -2.934711
O  0.294796 0.673789 1.470839
O  0.682383 2.158303 -0.155626
O  0.879911 -3.761854 -1.118436
N  2.123448 -0.922134 3.711172
C  -2.391844 1.739457 -0.659961
C  -2.163151 3.041088 0.049047
C  -1.556046 1.767066 0.607548
C  -1.739985 1.549102 -2.007713
C  -3.72532 1.041694 -0.550934
C  -3.214289 3.700027 0.832576
C  -0.096852 1.592081 0.569495
C  -3.400865 5.010473 0.923375
C  1.672848 0.312864 1.453021
C  1.995575 -0.586653 0.287766
C  1.905377 -0.374657 2.723741
C  1.319998 -1.794748 0.144646
C  2.935551 -0.197431 -0.652784
C  1.579936 -2.602566 -0.944195
C  3.206207 -1.007518 -1.746558
C  2.520601 -2.193401 -1.883753
C  1.547675 -4.95927 -1.010526
C  2.765741 -5.090302 -0.358052
C  0.916466 -6.063247 -1.56841
C  3.356792 -6.345537 -0.28016
C  1.517649 -7.308765 -1.476674
C  2.742252 -7.457012 -0.837161
H  -1.456461 3.700787 -0.44138
H  -2.039779 1.344243 1.480408
H  -2.454004 1.808387 -2.79089
H  -0.859571 2.169684 -2.154391
H  -1.453542 0.506536 -2.156172
H  -4.446395 1.493268 -1.234369
H  -3.61961 -0.008442 -0.827259
H  -4.145844 1.073383 0.453101
H  -3.891774 3.071727 1.398535
H  2.316749 1.197918 1.441222
H  0.586236 -2.11822 0.873967
H  3.462171 0.741049 -0.541361
H  3.93283 -0.713816 -2.492229
H  3.257771 -4.238877 0.095016
H  -0.036013 -5.945394 -2.069509
H  4.307878 -6.447163 0.226024
H  1.025098 -8.167505 -1.913632
H  3.210628 -8.42995 -0.772002
elementType: Cl F O N C H
totalener: -2149.92574708 hartree
nucrepener: 2860.78673978 hartree
electener: -5010.71248686 hartree
oneelecener: -8634.79541904 hartree
twoeener: 3624.08293219 hartree
cpcmener: -0.03777824 hartree
kineticenergy: 2143.45284483 hartree
xcener: -159.157660364826 hartree
chargesum: 0.0000000
charge: -0.057035 -0.061414 -0.208224 -0.286084 -0.464877 -0.334952 -0.100856 0.089077 0.032322 -0.069147 -0.269240 -0.268996 -0.202891 0.401904 0.040030 0.437765 -0.027841 -0.225158 -0.172863 -0.143963 0.120527 -0.167761 0.268425 0.273304 -0.164971 -0.239422 -0.171570 -0.130145 -0.183781 0.081224 0.100201 0.100144 0.094481 0.101900 0.102455 0.099127 0.093903 0.133162 0.143256 0.141879 0.154073 0.155374 0.153679 0.148953 0.162590 0.159939 0.161493
qa: -0.0570 -0.0614 -0.2082 -0.2861 -0.4649 -0.3350 -0.1009 0.0891 0.0323 -0.0691 -0.2692 -0.2690 -0.2029 0.4019 0.0400 0.4378 -0.0278 -0.2252 -0.1729 -0.1440 0.1205 -0.1678 0.2684 0.2733 -0.1650 -0.2394 -0.1716 -0.1301 -0.1838 0.0812 0.1002 0.1001 0.0945 0.1019 0.1025 0.0991 0.0939 0.1332 0.1433 0.1419 0.1541 0.1554 0.1537 0.1490 0.1626 0.1599 0.1615
va: 1.2685 1.2434 1.0843 2.1339 2.0465 2.0600 3.1097 3.7351 3.8769 3.8438 3.9047 3.9092 3.8979 4.1729 4.2094 3.7012 3.6200 4.0804 4.0162 3.9120 3.8052 3.9091 3.9962 3.6740 3.8546 3.9808 3.9111 3.8985 3.8894 1.0467 1.0322 1.0004 1.0175 0.9988 1.0002 1.0009 1.0055 1.0176 1.0136 1.0210 1.0017 0.9968 1.0026 1.0074 0.9897 0.9883 0.9888
dispcorr: -0.023717922 hartree
energy: -2149.949465005456
dipole: 4.87355 -5.20261 -0.32906 -31.06012 30.66293 -0.39720 -10.12037 9.12144 -0.99893
magnitude: 1.12424 au
magnitude: 2.85758 debye
