program: Orca
programVersion: 5.0.2
elementType: Cl Cl F O O O N C C C C C C C C C C C C C C C C C C C C C C H H H H H H H H H H H H H H H H H H
charge: 0
multiplicity: 1
keywords: wb97x-d3
keywords: def2-TZVPP
keywords: def2/J RIJCOSX
keywords: DEFGRID2
keywords: scfconv7
keywords: smallprint printgap noloewdin
keywords: NOSOSCF
formula: C22H18Cl2FNO3
InChI: InChI=1/C22H18Cl2FNO3/c1-22(2)15(11-19(23)24)20(22)21(27)29-18(12-26)13-8-9-16(25)17(10-13)28-14-6-4-3-5-7-14/h3-11,15,18,20H,1-2H3
47 atoms
Cl -2.460387 6.206579 -0.073629
Cl -4.584281 5.855832 1.843925
F  2.564443 -3.145865 -2.879304
O  0.301454 0.724499 1.43402
O  0.60117 2.149724 -0.262233
O  0.932756 -3.916471 -0.817447
N  2.276867 -0.652954 3.694455
C  -2.496117 1.733726 -0.574099
C  -2.209501 3.065312 0.054626
C  -1.590558 1.810076 0.642973
C  -1.921542 1.460534 -1.942748
C  -3.833692 1.068327 -0.359354
C  -3.20911 3.784307 0.853321
C  -0.137073 1.615284 0.52712
C  -3.385341 5.099622 0.865341
C  1.684371 0.383856 1.37074
C  1.965465 -0.587754 0.252406
C  1.99817 -0.198695 2.675315
C  1.365756 -1.843898 0.257116
C  2.786923 -0.212412 -0.798936
C  1.576009 -2.711872 -0.796749
C  3.0046 -1.079546 -1.859834
C  2.386476 -2.309296 -1.854205
C  1.670244 -5.078015 -0.81685
C  3.002921 -5.133784 -0.435263
C  0.989737 -6.228241 -1.195555
C  3.659213 -6.358412 -0.459438
C  1.657525 -7.442503 -1.206471
C  2.997579 -7.514183 -0.84624
H  -1.520427 3.687397 -0.505078
H  -2.028163 1.437228 1.561691
H  -2.672997 1.688442 -2.700016
H  -1.041143 2.055974 -2.17106
H  -1.658303 0.406663 -2.048238
H  -4.580442 1.494766 -1.031219
H  -3.759203 0.002733 -0.58056
H  -4.203288 1.164985 0.660284
H  -3.857448 3.202118 1.497146
H  2.306306 1.277209 1.259474
H  0.727149 -2.159067 1.074277
H  3.259078 0.760701 -0.802114
H  3.635672 -0.794383 -2.690866
H  3.536729 -4.248613 -0.113464
H  -0.05314 -6.16917 -1.480111
H  4.700388 -6.40113 -0.167979
H  1.125675 -8.336329 -1.505109
H  3.519197 -8.461553 -0.864107
elementType: Cl F O N C H
totalener: -2149.92578995 hartree
nucrepener: 2851.81038661 hartree
electener: -5001.73617656 hartree
oneelecener: -8616.84471188 hartree
twoeener: 3615.10853532 hartree
cpcmener: -0.03741759 hartree
kineticenergy: 2143.43917563 hartree
xcener: -159.155360468928 hartree
chargesum: 0.0000000
charge: -0.057117 -0.061223 -0.207715 -0.285454 -0.466967 -0.332437 -0.101261 0.088054 0.032061 -0.073807 -0.268879 -0.268864 -0.203206 0.410067 0.041155 0.440133 -0.029486 -0.226598 -0.178924 -0.143361 0.133563 -0.164835 0.258408 0.293202 -0.181812 -0.253547 -0.163775 -0.124333 -0.189992 0.079738 0.100747 0.099985 0.094067 0.102202 0.102251 0.099345 0.094187 0.132666 0.141530 0.142568 0.152386 0.156281 0.155696 0.148591 0.162470 0.161293 0.160947
qa: -0.0571 -0.0612 -0.2077 -0.2855 -0.4670 -0.3324 -0.1013 0.0881 0.0321 -0.0738 -0.2689 -0.2689 -0.2032 0.4101 0.0412 0.4401 -0.0295 -0.2266 -0.1789 -0.1434 0.1336 -0.1648 0.2584 0.2932 -0.1818 -0.2535 -0.1638 -0.1243 -0.1900 0.0797 0.1007 0.1000 0.0941 0.1022 0.1023 0.0993 0.0942 0.1327 0.1415 0.1426 0.1524 0.1563 0.1557 0.1486 0.1625 0.1613 0.1609
va: 1.2686 1.2438 1.0848 2.1368 2.0442 2.0638 3.1103 3.7352 3.8736 3.8512 3.9050 3.9090 3.8981 4.1653 4.2094 3.7005 3.6330 4.0758 4.0384 3.9100 3.7917 3.9107 3.9899 3.6662 3.8652 3.9874 3.9056 3.8910 3.8974 1.0477 1.0320 1.0003 1.0175 0.9986 1.0003 1.0009 1.0054 1.0177 1.0142 1.0202 1.0041 0.9967 1.0026 1.0080 0.9896 0.9878 0.9892
dispcorr: -0.023549955 hartree
energy: -2149.949339907092
dipole: 4.67295 -5.07999 -0.40704 -31.55183 31.08533 -0.46650 -9.23400 8.17851 -1.05549
magnitude: 1.22367 au
magnitude: 3.11032 debye
