program: Orca
programVersion: 5.0.2
elementType: Cl Cl F O O O N C C C C C C C C C C C C C C C C C C C C C C H H H H H H H H H H H H H H H H H H
charge: 0
multiplicity: 1
keywords: wb97x-d3
keywords: def2-TZVPP
keywords: def2/J RIJCOSX
keywords: DEFGRID2
keywords: scfconv7
keywords: smallprint printgap noloewdin
keywords: NOSOSCF
formula: C22H18Cl2FNO3
InChI: InChI=1/C22H18Cl2FNO3/c1-22(2)15(11-19(23)24)20(22)21(27)29-18(12-26)13-8-9-16(25)17(10-13)28-14-6-4-3-5-7-14/h3-11,15,18,20H,1-2H3
47 atoms
Cl -2.57227 -0.605011 0.983469
Cl -4.224303 -1.021612 -1.340638
F  3.918792 -2.853491 -1.399641
O  0.944732 2.412121 0.339845
O  1.571734 2.879618 -1.749989
O  1.416073 -2.613034 -0.62521
N  2.340767 1.924665 3.277614
C  -1.807501 3.580731 -0.540677
C  -1.77929 2.090437 -0.387082
C  -0.744096 2.778185 -1.264708
C  -1.464249 4.421263 0.664352
C  -2.846827 4.221168 -1.427839
C  -2.740744 1.186139 -1.025671
C  0.691725 2.718448 -0.940631
C  -3.123796 0.019863 -0.520602
C  2.283706 2.080427 0.669712
C  2.711055 0.752897 0.083249
C  2.302881 2.001767 2.130879
C  1.816063 -0.312125 0.048165
C  4.002697 0.607393 -0.395954
C  2.224387 -1.533044 -0.464127
C  4.419467 -0.615823 -0.900189
C  3.532626 -1.667431 -0.919856
C  0.437652 -2.932221 0.286619
C  -0.696574 -3.546018 -0.225869
C  0.58657 -2.73478 1.652106
C  -1.688773 -3.974652 0.641887
C  -0.423157 -3.157679 2.50644
C  -1.559362 -3.780371 2.009919
H  -1.404582 1.754156 0.571513
H  -0.902972 2.704889 -2.334599
H  -2.379638 4.674443 1.201552
H  -0.803436 3.920868 1.368382
H  -0.992427 5.356798 0.359868
H  -3.040525 3.653887 -2.337097
H  -3.79021 4.326182 -0.889473
H  -2.522512 5.218552 -1.727811
H  -3.147741 1.464961 -1.990064
H  2.981504 2.868997 0.369996
H  0.801102 -0.195598 0.409904
H  4.689528 1.443205 -0.379726
H  5.425006 -0.750083 -1.276146
H  -0.79426 -3.693619 -1.294005
H  1.476099 -2.268896 2.056846
H  -2.57173 -4.455181 0.241471
H  -0.309248 -3.005088 3.571648
H  -2.338514 -4.109812 2.684066
elementType: Cl F O N C H
totalener: -2149.92123793 hartree
nucrepener: 3122.01310388 hartree
electener: -5271.93434181 hartree
oneelecener: -9157.38722809 hartree
twoeener: 3885.45288628 hartree
cpcmener: -0.03877311 hartree
kineticenergy: 2143.45663470 hartree
xcener: -159.163812595046 hartree
chargesum: -0.0000000
charge: -0.058370 -0.065779 -0.210238 -0.282428 -0.455906 -0.331153 -0.099533 0.085717 0.040547 -0.068134 -0.258097 -0.275173 -0.217248 0.400580 0.060854 0.384829 -0.004884 -0.219718 -0.176321 -0.192929 0.231495 -0.149465 0.184094 0.340908 -0.280703 -0.218015 -0.114950 -0.136268 -0.197125 0.085850 0.101618 0.097325 0.093741 0.101094 0.093592 0.101853 0.099199 0.135023 0.150542 0.136676 0.151027 0.154656 0.146640 0.157865 0.156834 0.161573 0.158304
qa: -0.0584 -0.0658 -0.2102 -0.2824 -0.4559 -0.3312 -0.0995 0.0857 0.0405 -0.0681 -0.2581 -0.2752 -0.2172 0.4006 0.0609 0.3848 -0.0049 -0.2197 -0.1763 -0.1929 0.2315 -0.1495 0.1841 0.3409 -0.2807 -0.2180 -0.1150 -0.1363 -0.1971 0.0859 0.1016 0.0973 0.0937 0.1011 0.0936 0.1019 0.0992 0.1350 0.1505 0.1367 0.1510 0.1547 0.1466 0.1579 0.1568 0.1616 0.1583
va: 1.2790 1.2407 1.0807 2.1151 2.0473 2.0826 3.1034 3.7772 3.8137 3.8251 3.9047 3.9139 3.9133 4.1690 4.1876 3.7432 3.6645 4.0723 3.9680 3.9416 3.6842 3.8638 4.0527 3.6169 3.9749 3.9073 3.8383 3.8517 3.8716 1.0410 1.0269 0.9999 1.0112 1.0005 1.0052 1.0003 1.0010 1.0187 1.0133 1.0095 0.9994 0.9963 1.0080 0.9970 0.9899 0.9891 0.9904
dispcorr: -0.028559101 hartree
energy: -2149.949797029061
dipole: -3.25750 2.38034 -0.87716 22.51037 -20.94955 1.56081 2.48998 -3.11995 -0.62997
magnitude: 1.89800 au
magnitude: 4.82433 debye
