program: Orca
programVersion: 5.0.2
elementType: Cl Cl F O O O N C C C C C C C C C C C C C C C C C C C C C C H H H H H H H H H H H H H H H H H H
charge: 0
multiplicity: 1
keywords: wb97x-d3
keywords: def2-TZVPP
keywords: def2/J RIJCOSX
keywords: DEFGRID2
keywords: scfconv7
keywords: smallprint printgap noloewdin
keywords: NOSOSCF
formula: C22H18Cl2FNO3
InChI: InChI=1/C22H18Cl2FNO3/c1-22(2)15(11-19(23)24)20(22)21(27)29-18(12-26)13-8-9-16(25)17(10-13)28-14-6-4-3-5-7-14/h3-11,15,18,20H,1-2H3
47 atoms
Cl -3.221829 -0.620745 2.185277
Cl -4.900314 -1.069148 -0.118264
F  4.254836 -3.03278 0.989722
O  1.249742 2.093458 -1.219732
O  0.942064 2.189308 0.990343
O  1.792868 -2.798229 0.11551
N  3.669298 3.979089 0.259604
C  -1.921702 3.189348 0.198042
C  -1.987519 1.71811 0.477316
C  -0.944944 2.254964 -0.492893
C  -1.466986 4.097816 1.31467
C  -2.948585 3.835966 -0.700488
C  -3.055907 0.867918 -0.060035
C  0.472571 2.180495 -0.119327
C  -3.636252 -0.134388 0.586575
C  2.642262 1.946546 -1.032706
C  3.055634 0.614347 -0.431398
C  3.19091 3.080706 -0.275881
C  2.175621 -0.461673 -0.44685
C  4.34341 0.454678 0.057109
C  2.579915 -1.695111 0.041395
C  4.755315 -0.780075 0.538142
C  3.876037 -1.835945 0.52566
C  0.558611 -2.800575 -0.502107
C  0.461274 -2.762542 -1.885371
C  -0.568196 -2.900583 0.295934
C  -0.794257 -2.819076 -2.472659
C  -1.816882 -2.976155 -0.306351
C  -1.93488 -2.925869 -1.687567
H  -1.593897 1.427309 1.444648
H  -1.143169 2.084934 -1.54457
H  -2.343183 4.498482 1.826994
H  -0.856812 3.595565 2.060509
H  -0.901154 4.9434 0.920625
H  -2.56924 4.788847 -1.071642
H  -3.20677 3.228804 -1.566898
H  -3.864968 4.037704 -0.143823
H  -3.40694 1.067837 -1.065558
H  3.06167 2.023119 -2.040179
H  1.173142 -0.357168 -0.839279
H  5.0450 1.278454 0.066643
H  5.757867 -0.918375 0.920443
H  1.351543 -2.689967 -2.497121
H  -0.471797 -2.930762 1.37358
H  -0.877029 -2.785319 -3.550813
H  -2.698774 -3.075373 0.310946
H  -2.910486 -2.975079 -2.151999
elementType: Cl F O N C H
totalener: -2149.92373536 hartree
nucrepener: 3094.98347727 hartree
electener: -5244.90721263 hartree
oneelecener: -9103.46307798 hartree
twoeener: 3858.55586535 hartree
cpcmener: -0.04113698 hartree
kineticenergy: 2143.44328108 hartree
xcener: -159.164375252670 hartree
chargesum: 0.0000000
charge: -0.057948 -0.060320 -0.214422 -0.292850 -0.454226 -0.332837 -0.099021 0.090318 0.044959 -0.082459 -0.271718 -0.267905 -0.210139 0.400491 0.051005 0.497789 -0.067910 -0.240536 -0.215184 -0.221213 0.270022 -0.144694 0.181281 0.267156 -0.193059 -0.215625 -0.142669 -0.120774 -0.168447 0.084959 0.099480 0.099408 0.094627 0.103728 0.099752 0.093465 0.102521 0.133736 0.154862 0.145062 0.140958 0.153048 0.159024 0.146270 0.162923 0.143720 0.153395
qa: -0.0579 -0.0603 -0.2144 -0.2928 -0.4542 -0.3328 -0.0990 0.0903 0.0450 -0.0825 -0.2717 -0.2679 -0.2101 0.4005 0.0510 0.4978 -0.0679 -0.2405 -0.2152 -0.2212 0.2700 -0.1447 0.1813 0.2672 -0.1931 -0.2156 -0.1427 -0.1208 -0.1684 0.0850 0.0995 0.0994 0.0946 0.1037 0.0998 0.0935 0.1025 0.1337 0.1549 0.1451 0.1410 0.1530 0.1590 0.1463 0.1629 0.1437 0.1534
va: 1.2658 1.2448 1.0732 2.1333 2.0464 2.0751 3.1003 3.7638 3.8550 3.8680 3.9035 3.9093 3.9139 4.1338 4.2089 3.7526 3.8547 4.0989 3.9302 3.9502 3.6703 3.8900 4.0608 3.6963 3.9419 4.0115 3.9072 3.8205 3.8820 1.0452 1.0358 1.0000 1.0182 0.9992 1.0007 1.0057 1.0001 1.0183 0.9869 1.0195 1.0096 0.9977 0.9955 1.0106 0.9882 1.0128 1.0006
dispcorr: -0.028176955 hartree
energy: -2149.951912311263
dipole: -2.21751 0.73097 -1.48654 21.14047 -20.81216 0.32832 -11.06939 8.33608 -2.73331
magnitude: 3.12867 au
magnitude: 7.95245 debye
