program: Orca
programVersion: 5.0.2
elementType: Cl Cl F O O O N C C C C C C C C C C C C C C C C C C C C C C H H H H H H H H H H H H H H H H H H
charge: 0
multiplicity: 1
keywords: wb97x-d3
keywords: def2-TZVPP
keywords: def2/J RIJCOSX
keywords: DEFGRID2
keywords: scfconv7
keywords: smallprint printgap noloewdin
keywords: NOSOSCF
formula: C22H18Cl2FNO3
InChI: InChI=1/C22H18Cl2FNO3/c1-22(2)15(11-19(23)24)20(22)21(27)29-18(12-26)13-8-9-16(25)17(10-13)28-14-6-4-3-5-7-14/h3-11,15,18,20H,1-2H3
47 atoms
Cl -5.068616 3.880428 -0.9491
Cl -4.598854 6.324652 0.511114
F  1.345308 -4.383147 1.328809
O  0.989878 1.780536 0.22315
O  -0.760263 0.938063 -0.884247
O  1.452922 -3.896767 -1.354809
N  4.27764 1.755261 -0.07924
C  -2.183734 1.913185 1.768969
C  -2.560156 2.795356 0.612597
C  -1.09982 2.515405 0.891461
C  -2.518551 0.445399 1.668758
C  -2.261966 2.439554 3.180853
C  -3.05057 4.164154 0.817739
C  -0.327061 1.666988 -0.028063
C  -4.094226 4.70626 0.204258
C  1.844553 0.890465 -0.480374
C  1.719117 -0.53039 0.018039
C  3.199455 1.391393 -0.245187
C  1.674516 -1.572157 -0.896815
C  1.658701 -0.79108 1.381354
C  1.557983 -2.87766 -0.452637
C  1.532917 -2.095467 1.831982
C  1.477645 -3.120881 0.911994
C  2.424055 -4.872411 -1.369201
C  3.712025 -4.660075 -0.896752
C  2.060617 -6.092959 -1.922052
C  4.636703 -5.694002 -0.972078
C  2.998002 -7.112014 -1.995567
C  4.288015 -6.921609 -1.516384
H  -2.974593 2.267477 -0.238898
H  -0.530767 3.313328 1.354928
H  -3.473115 0.259013 2.163088
H  -2.610663 0.092081 0.644516
H  -1.76254 -0.160141 2.172599
H  -3.288137 2.387108 3.548291
H  -1.642372 1.830066 3.840264
H  -1.92284 3.469981 3.275643
H  -2.520281 4.790502 1.525235
H  1.663973 0.932271 -1.559729
H  1.721499 -1.375956 -1.961056
H  1.703052 0.014004 2.103297
H  1.473038 -2.31538 2.889588
H  4.007786 -3.70567 -0.479503
H  1.052831 -6.241944 -2.28873
H  5.640274 -5.529913 -0.601825
H  2.712023 -8.063703 -2.42388
H  5.014128 -7.721811 -1.56914
elementType: Cl F O N C H
totalener: -2149.92499479 hartree
nucrepener: 2848.33077332 hartree
electener: -4998.25576812 hartree
oneelecener: -8609.77172849 hartree
twoeener: 3611.51596037 hartree
cpcmener: -0.03952811 hartree
kineticenergy: 2143.44682096 hartree
xcener: -159.156647617030 hartree
chargesum: -0.0000000
charge: -0.056871 -0.061295 -0.209556 -0.281337 -0.456451 -0.334921 -0.100432 0.093795 0.034850 -0.073828 -0.267666 -0.262761 -0.202611 0.378526 0.036606 0.424652 0.005330 -0.222334 -0.189560 -0.196439 0.152905 -0.167882 0.280382 0.269882 -0.168442 -0.241939 -0.166472 -0.128165 -0.185612 0.081494 0.102288 0.102316 0.095309 0.098384 0.101739 0.098991 0.092676 0.134720 0.145316 0.143385 0.153815 0.155789 0.156926 0.149214 0.162993 0.160880 0.161410
qa: -0.0569 -0.0613 -0.2096 -0.2813 -0.4565 -0.3349 -0.1004 0.0938 0.0349 -0.0738 -0.2677 -0.2628 -0.2026 0.3785 0.0366 0.4247 0.0053 -0.2223 -0.1896 -0.1964 0.1529 -0.1679 0.2804 0.2699 -0.1684 -0.2419 -0.1665 -0.1282 -0.1856 0.0815 0.1023 0.1023 0.0953 0.0984 0.1017 0.0990 0.0927 0.1347 0.1453 0.1434 0.1538 0.1558 0.1569 0.1492 0.1630 0.1609 0.1614
va: 1.2688 1.2439 1.0810 2.1228 2.0511 2.0599 3.1100 3.7329 3.8805 3.8358 3.9039 3.9051 3.8897 4.2114 4.2090 3.6888 3.6048 4.0915 4.0341 3.9184 3.7606 3.9120 3.9841 3.6708 3.8624 3.9868 3.9098 3.8953 3.8920 1.0457 1.0325 1.0012 1.0164 0.9998 1.0008 1.0011 1.0050 1.0157 1.0162 1.0128 1.0093 0.9967 1.0008 1.0074 0.9894 0.9879 0.9889
dispcorr: -0.024144599 hartree
energy: -2149.949139393188
dipole: 16.56318 -16.80031 -0.23712 -24.03480 23.75498 -0.27983 10.37089 -8.94264 1.42825
magnitude: 1.47459 au
magnitude: 3.74812 debye
