program: Orca
programVersion: 5.0.2
elementType: Cl Cl F O O O N C C C C C C C C C C C C C C C C C C C C C C H H H H H H H H H H H H H H H H H H
charge: 0
multiplicity: 1
keywords: wb97x-d3
keywords: def2-TZVPP
keywords: def2/J RIJCOSX
keywords: DEFGRID2
keywords: scfconv7
keywords: smallprint printgap noloewdin
keywords: NOSOSCF
formula: C22H18Cl2FNO3
InChI: InChI=1/C22H18Cl2FNO3/c1-22(2)15(11-19(23)24)20(22)21(27)29-18(12-26)13-8-9-16(25)17(10-13)28-14-6-4-3-5-7-14/h3-11,15,18,20H,1-2H3
47 atoms
Cl -4.903955 3.215193 -1.222048
Cl -5.10754 5.343452 0.713284
F  3.729747 -3.769489 0.968625
O  1.144444 1.943271 0.446762
O  -0.292002 0.883982 -0.899677
O  2.999772 -3.197316 -1.599732
N  4.242914 3.052214 0.121343
C  -2.151521 1.167585 1.6259
C  -2.542965 2.176244 0.585947
C  -1.094146 2.073695 1.021913
C  -2.225899 -0.29109 1.24758
C  -2.47553 1.415566 3.079045
C  -3.284116 3.395912 0.928941
C  -0.09064 1.562143 0.076418
C  -4.290439 3.905877 0.230673
C  2.225271 1.456414 -0.341599
C  2.601182 0.041772 0.022471
C  3.342744 2.361608 -0.068212
C  2.573105 -0.950341 -0.947989
C  2.972969 -0.265088 1.325875
C  2.952239 -2.24212 -0.626465
C  3.344471 -1.557294 1.656669
C  3.344066 -2.525361 0.675139
C  2.230523 -4.33069 -1.465168
C  1.069689 -4.36761 -0.705539
C  2.657456 -5.448356 -2.169315
C  0.340541 -5.548409 -0.64721
C  1.913979 -6.616772 -2.10576
C  0.755623 -6.675748 -1.341329
H  -2.755066 1.754267 -0.38984
H  -0.734111 2.854256 1.682288
H  -3.188977 -0.694384 1.564117
H  -2.138463 -0.465863 0.178057
H  -1.446917 -0.864185 1.753375
H  -1.842068 0.793704 3.713104
H  -2.3240 2.450313 3.382439
H  -3.513702 1.151581 3.287193
H  -2.990223 3.931923 1.823597
H  2.002094 1.530385 -1.410348
H  2.274629 -0.722052 -1.96377
H  2.990554 0.500272 2.091709
H  3.648984 -1.809468 2.663719
H  0.720941 -3.495201 -0.167172
H  3.564435 -5.401856 -2.75853
H  -0.563606 -5.579036 -0.053516
H  2.249554 -7.487872 -2.653004
H  0.181608 -7.590973 -1.289394
elementType: Cl F O N C H
totalener: -2149.92568737 hartree
nucrepener: 2870.49906916 hartree
electener: -5020.42475654 hartree
oneelecener: -8653.99350757 hartree
twoeener: 3633.56875104 hartree
cpcmener: -0.03817165 hartree
kineticenergy: 2143.44910195 hartree
xcener: -159.156903558434 hartree
chargesum: 0.0000000
charge: -0.056919 -0.060824 -0.208277 -0.282218 -0.467803 -0.333153 -0.100977 0.090674 0.034504 -0.084820 -0.269536 -0.263846 -0.202437 0.412269 0.038045 0.425570 -0.023997 -0.222840 -0.168435 -0.177833 0.148820 -0.173308 0.276147 0.272401 -0.170674 -0.244924 -0.166716 -0.127808 -0.184156 0.081536 0.100275 0.100108 0.094009 0.101926 0.098743 0.092863 0.101883 0.134576 0.141399 0.143849 0.154621 0.155010 0.159590 0.148376 0.162188 0.161212 0.160907
qa: -0.0569 -0.0608 -0.2083 -0.2822 -0.4678 -0.3332 -0.1010 0.0907 0.0345 -0.0848 -0.2695 -0.2638 -0.2024 0.4123 0.0380 0.4256 -0.0240 -0.2228 -0.1684 -0.1778 0.1488 -0.1733 0.2761 0.2724 -0.1707 -0.2449 -0.1667 -0.1278 -0.1842 0.0815 0.1003 0.1001 0.0940 0.1019 0.0987 0.0929 0.1019 0.1346 0.1414 0.1438 0.1546 0.1550 0.1596 0.1484 0.1622 0.1612 0.1609
va: 1.2686 1.2441 1.0824 2.1344 2.0423 2.0625 3.1104 3.7319 3.8756 3.8631 3.9060 3.9074 3.8943 4.1676 4.2093 3.6969 3.6203 4.0892 3.9978 3.9406 3.7734 3.9307 3.9816 3.6700 3.8619 3.9896 3.9095 3.8914 3.8923 1.0459 1.0328 1.0003 1.0174 0.9990 1.0013 1.0054 1.0008 1.0161 1.0173 1.0156 1.0058 0.9974 0.9994 1.0077 0.9898 0.9877 0.9891
dispcorr: -0.023664420 hartree
energy: -2149.949351794336
dipole: 6.33646 -7.41492 -1.07846 -25.75926 24.80306 -0.95621 10.33321 -8.76465 1.56856
magnitude: 2.13021 au
magnitude: 5.41456 debye
