program: Orca
programVersion: 5.0.2
elementType: Cl Cl F O O O N C C C C C C C C C C C C C C C C C C C C C C H H H H H H H H H H H H H H H H H H
charge: 0
multiplicity: 1
keywords: wb97x-d3
keywords: def2-TZVPP
keywords: def2/J RIJCOSX
keywords: DEFGRID2
keywords: scfconv7
keywords: smallprint printgap noloewdin
keywords: NOSOSCF
formula: C22H18Cl2FNO3
InChI: InChI=1/C22H18Cl2FNO3/c1-22(2)15(11-19(23)24)20(22)21(27)29-18(12-26)13-8-9-16(25)17(10-13)28-14-6-4-3-5-7-14/h3-11,15,18,20H,1-2H3
47 atoms
Cl -1.926321 4.13602 -0.773064
Cl -4.292945 5.197655 0.494472
F  3.943492 -3.714015 1.639511
O  0.804341 1.430145 0.301593
O  -0.442891 0.165977 -1.064867
O  2.632076 -3.758146 -0.684964
N  3.585376 3.138731 -0.200051
C  -2.558062 0.339439 1.24328
C  -2.853625 1.394448 0.237786
C  -1.450175 1.286884 0.796619
C  -2.575853 -1.102816 0.802495
C  -3.015831 0.540108 2.66744
C  -3.662817 2.590604 0.556681
C  -0.358177 0.879293 -0.095745
C  -3.341282 3.808702 0.146983
C  1.979255 1.091609 -0.434909
C  2.589757 -0.176331 0.1012
C  2.872342 2.240966 -0.288404
C  2.373797 -1.360433 -0.588544
C  3.27894 -0.186112 1.308637
C  2.816705 -2.562256 -0.060339
C  3.754979 -1.380015 1.824279
C  3.507832 -2.55347 1.142827
C  1.401257 -4.027613 -1.243433
C  1.396536 -4.741111 -2.431958
C  0.212597 -3.646308 -0.633324
C  0.183959 -5.080316 -3.015763
C  -0.991169 -3.984376 -1.235183
C  -1.013019 -4.697909 -2.426205
H  -2.960975 1.041253 -0.785141
H  -1.173753 2.032415 1.532668
H  -3.558682 -1.527998 1.011689
H  -2.38981 -1.22812 -0.261311
H  -1.839996 -1.691525 1.352514
H  -2.943766 1.579821 2.987149
H  -4.054046 0.22435 2.782843
H  -2.409857 -0.05852 3.34893
H  -4.575229 2.46627 1.12852
H  1.761549 0.990774 -1.502258
H  1.851173 -1.352351 -1.53654
H  3.456056 0.731269 1.85562
H  4.300355 -1.40393 2.758316
H  2.332205 -5.030138 -2.893276
H  0.21209 -3.097941 0.300439
H  0.179984 -5.638683 -3.942499
H  -1.918493 -3.688539 -0.761722
H  -1.955979 -4.956731 -2.888573
elementType: Cl F O N C H
totalener: -2149.92264720 hartree
nucrepener: 2992.49407293 hartree
electener: -5142.41672012 hartree
oneelecener: -8898.19745281 hartree
twoeener: 3755.78073269 hartree
cpcmener: -0.03623926 hartree
kineticenergy: 2143.47002366 hartree
xcener: -159.161334572590 hartree
chargesum: 0.0000000
charge: -0.052242 -0.056203 -0.208819 -0.276041 -0.472665 -0.340243 -0.100056 0.163531 -0.028608 -0.160976 -0.308425 -0.278852 -0.218275 0.436788 0.077780 0.409071 -0.030799 -0.215688 -0.142818 -0.183108 0.192919 -0.170470 0.208712 0.288146 -0.248280 -0.200047 -0.122093 -0.149818 -0.193561 0.116352 0.116853 0.102932 0.090108 0.108102 0.095424 0.103081 0.100138 0.142881 0.138553 0.152673 0.146137 0.155275 0.149764 0.164397 0.161459 0.175265 0.161744
qa: -0.0522 -0.0562 -0.2088 -0.2760 -0.4727 -0.3402 -0.1001 0.1635 -0.0286 -0.1610 -0.3084 -0.2789 -0.2183 0.4368 0.0778 0.4091 -0.0308 -0.2157 -0.1428 -0.1831 0.1929 -0.1705 0.2087 0.2881 -0.2483 -0.2000 -0.1221 -0.1498 -0.1936 0.1164 0.1169 0.1029 0.0901 0.1081 0.0954 0.1031 0.1001 0.1429 0.1386 0.1527 0.1461 0.1553 0.1498 0.1644 0.1615 0.1753 0.1617
va: 1.2798 1.2504 1.0839 2.1215 2.0296 2.0719 3.1093 3.6888 3.8726 3.8691 3.8949 3.9158 3.9120 4.0987 4.1804 3.7312 3.6909 4.0653 3.8925 3.9553 3.7119 3.8960 4.0840 3.6925 4.0016 3.8918 3.8850 3.8692 3.9272 1.0188 1.0237 1.0029 1.0120 0.9932 0.9994 0.9998 1.0026 1.0077 1.0181 1.0138 1.0060 0.9967 1.0060 0.9909 0.9873 0.9811 0.9904
dispcorr: -0.026714175 hartree
energy: -2149.949361372959
dipole: -9.69423 7.57475 -2.11948 -28.21426 26.99674 -1.21752 3.64688 -2.80751 0.83938
magnitude: 2.58440 au
magnitude: 6.56901 debye
