program: Orca
programVersion: 5.0.2
elementType: Cl Cl F O O O N C C C C C C C C C C C C C C C C C C C C C C H H H H H H H H H H H H H H H H H H
charge: 0
multiplicity: 1
keywords: wb97x-d3
keywords: def2-TZVPP
keywords: def2/J RIJCOSX
keywords: DEFGRID2
keywords: scfconv7
keywords: smallprint printgap noloewdin
keywords: NOSOSCF
formula: C22H18Cl2FNO3
InChI: InChI=1/C22H18Cl2FNO3/c1-22(2)15(11-19(23)24)20(22)21(27)29-18(12-26)13-8-9-16(25)17(10-13)28-14-6-4-3-5-7-14/h3-11,15,18,20H,1-2H3
47 atoms
Cl -3.30311 -0.149399 1.470879
Cl -4.614074 -1.007057 -0.95067
F  4.271596 -2.833754 -1.353048
O  0.940897 2.230305 0.279696
O  1.527265 2.635237 -1.834854
O  1.752004 -2.736506 -0.600249
N  2.380872 1.974964 3.227944
C  -1.812619 3.368481 -0.649405
C  -1.810076 1.892161 -0.372852
C  -0.778045 2.481333 -1.314208
C  -1.427435 4.29725 0.474395
C  -2.854463 3.954763 -1.5699
C  -2.81391 0.974506 -0.927848
C  0.663379 2.473572 -1.008656
C  -3.479361 0.066163 -0.226238
C  2.302765 2.018067 0.615911
C  2.833004 0.709755 0.074722
C  2.329876 2.000142 2.079298
C  2.001823 -0.405323 0.032034
C  4.144928 0.632953 -0.360247
C  2.488731 -1.604933 -0.458767
C  4.64101 -0.571493 -0.841215
C  3.81302 -1.668523 -0.88393
C  0.611165 -2.901282 0.158703
C  -0.590929 -3.084488 -0.505993
C  0.683377 -2.942109 1.543804
C  -1.741708 -3.324006 0.233727
C  -0.475739 -3.173597 2.270217
C  -1.688623 -3.365361 1.619822
H  -1.441465 1.627662 0.610864
H  -0.952077 2.321095 -2.372484
H  -0.932999 5.188969 0.085289
H  -2.325943 4.62263 1.000988
H  -0.770463 3.838685 1.209913
H  -3.081108 3.312346 -2.41972
H  -3.783574 4.133093 -1.025844
H  -2.512238 4.912598 -1.964464
H  -3.019738 1.025208 -1.989957
H  2.934765 2.848283 0.283698
H  0.974015 -0.339612 0.367831
H  4.784918 1.50474 -0.331493
H  5.663642 -0.654153 -1.184679
H  -0.624956 -3.049643 -1.587522
H  1.630826 -2.801105 2.050469
H  -2.68355 -3.470623 -0.27914
H  -0.426148 -3.208193 3.350727
H  -2.588327 -3.546749 2.192193
elementType: Cl F O N C H
totalener: -2149.92231390 hartree
nucrepener: 3102.13896321 hartree
electener: -5252.06127711 hartree
oneelecener: -9117.50277016 hartree
twoeener: 3865.44149305 hartree
cpcmener: -0.03910082 hartree
kineticenergy: 2143.45566575 hartree
xcener: -159.161723400737 hartree
chargesum: -0.0000000
charge: -0.059174 -0.063120 -0.211882 -0.280376 -0.455436 -0.334848 -0.098922 0.094275 0.050596 -0.093948 -0.264538 -0.265640 -0.227551 0.409630 0.060099 0.380149 -0.018220 -0.220952 -0.151482 -0.201508 0.202844 -0.147537 0.191156 0.272670 -0.228092 -0.183713 -0.133938 -0.130480 -0.188117 0.086682 0.100843 0.102625 0.097327 0.094442 0.091742 0.100906 0.099971 0.137696 0.151943 0.145160 0.150736 0.154339 0.149364 0.159047 0.154345 0.163176 0.157710
qa: -0.0592 -0.0631 -0.2119 -0.2804 -0.4554 -0.3348 -0.0989 0.0943 0.0506 -0.0939 -0.2645 -0.2656 -0.2276 0.4096 0.0601 0.3801 -0.0182 -0.2210 -0.1515 -0.2015 0.2028 -0.1475 0.1912 0.2727 -0.2281 -0.1837 -0.1339 -0.1305 -0.1881 0.0867 0.1008 0.1026 0.0973 0.0944 0.0917 0.1009 0.1000 0.1377 0.1519 0.1452 0.1507 0.1543 0.1494 0.1590 0.1543 0.1632 0.1577
va: 1.2628 1.2423 1.0780 2.1163 2.0482 2.0706 3.1058 3.7451 3.8077 3.8800 3.9115 3.9112 3.9044 4.1471 4.1787 3.7485 3.6898 4.0731 3.9047 3.9490 3.7088 3.8721 4.0505 3.6748 3.9846 3.9422 3.8068 3.8693 3.8556 1.0385 1.0296 0.9999 1.0003 1.0109 1.0045 1.0009 1.0014 1.0147 1.0126 1.0133 0.9997 0.9962 1.0053 0.9958 1.0008 0.9873 0.9945
dispcorr: -0.028345121 hartree
energy: -2149.950659022571
dipole: -1.12813 0.16987 -0.95825 21.13343 -19.72359 1.40984 -1.37646 0.58256 -0.79390
magnitude: 1.88047 au
magnitude: 4.77978 debye
