program: Orca
programVersion: 5.0.2
elementType: Cl Cl F O O O N C C C C C C C C C C C C C C C C C C C C C C H H H H H H H H H H H H H H H H H H
charge: 0
multiplicity: 1
keywords: wb97x-d3
keywords: def2-TZVPP
keywords: def2/J RIJCOSX
keywords: DEFGRID2
keywords: scfconv7
keywords: smallprint printgap noloewdin
keywords: NOSOSCF
formula: C22H18Cl2FNO3
InChI: InChI=1/C22H18Cl2FNO3/c1-22(2)15(11-19(23)24)20(22)21(27)29-18(12-26)13-8-9-16(25)17(10-13)28-14-6-4-3-5-7-14/h3-11,15,18,20H,1-2H3
47 atoms
Cl -3.472688 -0.178504 1.279145
Cl -4.678145 -0.846525 -1.255433
F  4.3334 -2.79232 -1.377263
O  0.936747 2.165871 0.415643
O  1.603031 2.696557 -1.646137
O  1.788858 -2.739965 -0.693178
N  2.276554 1.76931 3.396575
C  -1.765541 3.389422 -0.538235
C  -1.798492 1.897172 -0.365664
C  -0.720518 2.530551 -1.222675
C  -1.410701 4.23175 0.66176
C  -2.760789 4.05588 -1.455589
C  -2.800417 1.048233 -1.024414
C  0.707866 2.489704 -0.864324
C  -3.539022 0.131727 -0.411679
C  2.287119 1.941228 0.788769
C  2.841448 0.664864 0.198401
C  2.263669 1.847882 2.24928
C  2.015964 -0.447385 0.069384
C  4.166817 0.613156 -0.19714
C  2.520399 -1.617542 -0.471478
C  4.680976 -0.5627 -0.726648
C  3.857458 -1.656255 -0.85766
C  0.621343 -2.923514 0.021296
C  0.660677 -3.086097 1.398266
C  -0.572494 -2.986161 -0.677978
C  -0.52416 -3.315809 2.082139
C  -1.750382 -3.222774 0.018436
C  -1.730443 -3.383835 1.396667
H  -1.476232 1.554891 0.610519
H  -0.854605 2.444931 -2.29535
H  -0.79911 3.708647 1.393253
H  -0.879503 5.13462 0.355876
H  -2.32525 4.544253 1.168174
H  -2.385731 5.030122 -1.772471
H  -2.966457 3.475055 -2.353686
H  -3.706409 4.217311 -0.935392
H  -2.943762 1.163246 -2.092295
H  2.925937 2.789124 0.521327
H  0.978521 -0.400503 0.376965
H  4.803282 1.482644 -0.100736
H  5.714393 -0.626545 -1.040547
H  1.60239 -3.035905 1.930802
H  -0.580563 -2.857993 -1.752729
H  -0.501218 -3.442349 3.156449
H  -2.686808 -3.272907 -0.52131
H  -2.651196 -3.561391 1.935583
elementType: Cl F O N C H
totalener: -2149.92256404 hartree
nucrepener: 3096.46867967 hartree
electener: -5246.39124371 hartree
oneelecener: -9106.08854908 hartree
twoeener: 3859.69730536 hartree
cpcmener: -0.03922281 hartree
kineticenergy: 2143.46176540 hartree
xcener: -159.162464920720 hartree
chargesum: -0.0000000
charge: -0.059288 -0.062764 -0.211924 -0.280432 -0.456668 -0.336516 -0.099039 0.097649 0.049514 -0.096660 -0.266093 -0.265291 -0.228744 0.412017 0.059548 0.383529 -0.020356 -0.222001 -0.149323 -0.201438 0.198069 -0.147666 0.194012 0.261283 -0.177460 -0.215600 -0.138428 -0.145646 -0.174223 0.086683 0.100786 0.094311 0.103436 0.097261 0.100113 0.091708 0.100759 0.138209 0.151298 0.145724 0.150792 0.154273 0.159582 0.149568 0.162913 0.154301 0.158219
qa: -0.0593 -0.0628 -0.2119 -0.2804 -0.4567 -0.3365 -0.0990 0.0976 0.0495 -0.0967 -0.2661 -0.2653 -0.2287 0.4120 0.0595 0.3835 -0.0204 -0.2220 -0.1493 -0.2014 0.1981 -0.1477 0.1940 0.2613 -0.1775 -0.2156 -0.1384 -0.1456 -0.1742 0.0867 0.1008 0.0943 0.1034 0.0973 0.1001 0.0917 0.1008 0.1382 0.1513 0.1457 0.1508 0.1543 0.1596 0.1496 0.1629 0.1543 0.1582
va: 1.2623 1.2425 1.0779 2.1169 2.0473 2.0688 3.1065 3.7391 3.8127 3.8868 3.9122 3.9115 3.8980 4.1427 4.1776 3.7443 3.6922 4.0740 3.8972 3.9479 3.7068 3.8729 4.0510 3.6880 3.9435 3.9782 3.8827 3.8206 3.8535 1.0374 1.0299 1.0107 0.9997 1.0004 1.0012 1.0044 1.0010 1.0142 1.0132 1.0142 0.9996 0.9962 0.9957 1.0047 0.9877 1.0011 0.9943
dispcorr: -0.028229031 hartree
energy: -2149.950793069885
dipole: -0.35569 -0.55317 -0.90887 20.98579 -19.53138 1.45442 0.18571 -0.91457 -0.72886
magnitude: 1.86349 au
magnitude: 4.73661 debye
