program: Orca
programVersion: 5.0.2
elementType: Cl Cl F O O O N C C C C C C C C C C C C C C C C C C C C C C H H H H H H H H H H H H H H H H H H
charge: 0
multiplicity: 1
keywords: wb97x-d3
keywords: def2-TZVPP
keywords: def2/J RIJCOSX
keywords: DEFGRID2
keywords: scfconv7
keywords: smallprint printgap noloewdin
keywords: NOSOSCF
formula: C22H18Cl2FNO3
InChI: InChI=1/C22H18Cl2FNO3/c1-22(2)15(11-19(23)24)20(22)21(27)29-18(12-26)13-8-9-16(25)17(10-13)28-14-6-4-3-5-7-14/h3-11,15,18,20H,1-2H3
47 atoms
Cl -3.433276 0.136683 1.961481
Cl -4.863406 -0.985901 -0.276838
F  4.510796 -2.891613 -1.137894
O  0.98034 2.113173 0.228419
O  1.410564 2.33226 -1.948877
O  2.034054 -2.852454 -0.283868
N  2.631959 2.252587 3.074998
C  -1.827677 3.171026 -0.637451
C  -1.826861 1.733371 -0.198802
C  -0.849685 2.192529 -1.260045
C  -1.362294 4.210973 0.350334
C  -2.924056 3.668148 -1.547842
C  -2.898149 0.806505 -0.591811
C  0.608851 2.227443 -1.053587
C  -3.62524 0.087298 0.253016
C  2.372228 2.015431 0.485413
C  2.952854 0.693015 0.038262
C  2.498106 2.149841 1.937229
C  2.175579 -0.458722 0.11897
C  4.254724 0.63988 -0.426138
C  2.70292 -1.672303 -0.287248
C  4.794295 -0.579306 -0.818033
C  4.017175 -1.710814 -0.748429
C  0.71896 -2.861717 0.141983
C  -0.289812 -2.822186 -0.805972
C  0.436973 -2.943215 1.49648
C  -1.611645 -2.877364 -0.384537
C  -0.888308 -2.990943 1.904878
C  -1.912954 -2.960141 0.968016
H  -1.408294 1.564449 0.786352
H  -1.090736 1.917486 -2.281046
H  -0.898825 5.053505 -0.165423
H  -2.221581 4.595843 0.901609
H  -0.654238 3.829339 1.082176
H  -3.201373 2.9443 -2.312695
H  -3.818483 3.905635 -0.969392
H  -2.606765 4.579382 -2.056723
H  -3.119044 0.69945 -1.647175
H  2.924401 2.843895 0.029777
H  1.158583 -0.407791 0.486262
H  4.852769 1.539153 -0.491711
H  5.80933 -0.644538 -1.186977
H  -0.045382 -2.755367 -1.858552
H  1.241445 -2.969488 2.220815
H  -2.406099 -2.853155 -1.118787
H  -1.11852 -3.05474 2.960098
H  -2.943813 -3.002505 1.292434
elementType: Cl F O N C H
totalener: -2149.92296611 hartree
nucrepener: 3109.49496045 hartree
electener: -5259.41792656 hartree
oneelecener: -9131.99002645 hartree
twoeener: 3872.57209989 hartree
cpcmener: -0.03914245 hartree
kineticenergy: 2143.46289039 hartree
xcener: -159.163881789758 hartree
chargesum: 0.0000000
charge: -0.058578 -0.060525 -0.212885 -0.279282 -0.457326 -0.336092 -0.099258 0.099518 0.056346 -0.106590 -0.268294 -0.263387 -0.228282 0.416859 0.046187 0.378643 -0.028372 -0.221073 -0.168346 -0.210232 0.231849 -0.140904 0.190502 0.229594 -0.172818 -0.165226 -0.162874 -0.161680 -0.138565 0.092056 0.100264 0.102798 0.097887 0.094300 0.091736 0.100964 0.100801 0.139636 0.151235 0.142700 0.149828 0.153665 0.152570 0.153416 0.152897 0.161188 0.153152
qa: -0.0586 -0.0605 -0.2129 -0.2793 -0.4573 -0.3361 -0.0993 0.0995 0.0563 -0.1066 -0.2683 -0.2634 -0.2283 0.4169 0.0462 0.3786 -0.0284 -0.2211 -0.1683 -0.2102 0.2318 -0.1409 0.1905 0.2296 -0.1728 -0.1652 -0.1629 -0.1617 -0.1386 0.0921 0.1003 0.1028 0.0979 0.0943 0.0917 0.1010 0.1008 0.1396 0.1512 0.1427 0.1498 0.1537 0.1526 0.1534 0.1529 0.1612 0.1532
va: 1.2641 1.2450 1.0754 2.1176 2.0463 2.0752 3.1069 3.7461 3.7898 3.9078 3.9141 3.9102 3.8564 4.1329 4.1925 3.7421 3.7245 4.0723 3.9082 3.9577 3.6985 3.8704 4.0499 3.7144 3.9936 3.9444 3.8263 3.9217 3.7903 1.0356 1.0306 0.9998 1.0002 1.0109 1.0045 1.0011 1.0015 1.0126 1.0137 1.0205 1.0002 0.9963 1.0005 0.9990 0.9997 0.9908 1.0075
dispcorr: -0.029157205 hartree
energy: -2149.952123314319
dipole: -1.30222 0.11720 -1.18502 20.21605 -18.92475 1.29130 -6.26135 5.16579 -1.09556
magnitude: 2.06688 au
magnitude: 5.25358 debye
