program: Orca
programVersion: 5.0.2
elementType: Cl Cl F O O O N C C C C C C C C C C C C C C C C C C C C C C H H H H H H H H H H H H H H H H H H
charge: 0
multiplicity: 1
keywords: wb97x-d3
keywords: def2-TZVPP
keywords: def2/J RIJCOSX
keywords: DEFGRID2
keywords: scfconv7
keywords: smallprint printgap noloewdin
keywords: NOSOSCF
formula: C22H18Cl2FNO3
InChI: InChI=1/C22H18Cl2FNO3/c1-22(2)15(11-19(23)24)20(22)21(27)29-18(12-26)13-8-9-16(25)17(10-13)28-14-6-4-3-5-7-14/h3-11,15,18,20H,1-2H3
47 atoms
Cl -1.857019 5.075009 1.062597
Cl -4.72745 5.394861 1.093718
F  2.889397 -3.037133 -2.633754
O  0.592298 1.238981 1.334632
O  0.577432 2.185138 -0.691314
O  0.655725 -3.172658 -1.06787
N  2.79663 0.151436 3.529205
C  -2.396867 0.996058 -0.410077
C  -2.374038 2.48364 -0.528315
C  -1.481181 1.82491 0.487452
C  -1.827374 0.167179 -1.533401
C  -3.556956 0.336706 0.293014
C  -3.517574 3.307305 -0.076426
C  -0.026118 1.802805 0.278929
C  -3.385479 4.435327 0.605138
C  1.974441 0.956749 1.182618
C  2.231505 -0.12803 0.161282
C  2.418745 0.515265 2.505857
C  1.352063 -1.199214 0.054172
C  3.347196 -0.054981 -0.657418
C  1.571566 -2.175518 -0.898356
C  3.588161 -1.046861 -1.597629
C  2.693124 -2.086375 -1.715749
C  1.04731 -4.477147 -0.877843
C  0.288197 -5.44745 -1.517177
C  2.116915 -4.828298 -0.067171
C  0.611126 -6.784438 -1.345931
C  2.431378 -6.171967 0.087488
C  1.686683 -7.154136 -0.5488
H  -1.86129 2.872316 -1.40495
H  -1.789003 1.868051 1.526227
H  -1.452059 -0.78842 -1.162564
H  -2.612942 -0.049407 -2.259199
H  -1.020352 0.662596 -2.069905
H  -3.937495 0.93194 1.123471
H  -4.379674 0.16903 -0.404445
H  -3.257533 -0.633722 0.691507
H  -4.519789 2.987431 -0.338217
H  2.54396 1.857172 0.928776
H  0.479536 -1.281605 0.690717
H  4.031055 0.779494 -0.574651
H  4.451732 -0.999713 -2.247756
H  -0.544938 -5.156338 -2.143841
H  2.702075 -4.07747 0.4487
H  0.021012 -7.539932 -1.847554
H  3.267945 -6.446349 0.716039
H  1.940187 -8.197949 -0.423904
elementType: Cl F O N C H
totalener: -2149.92244104 hartree
nucrepener: 2948.14393761 hartree
electener: -5098.06637865 hartree
oneelecener: -8809.70446593 hartree
twoeener: 3711.63808728 hartree
cpcmener: -0.03783644 hartree
kineticenergy: 2143.46974408 hartree
xcener: -159.160902586426 hartree
chargesum: 0.0000000
charge: -0.051914 -0.057486 -0.209639 -0.282694 -0.448443 -0.337354 -0.100265 0.150157 -0.024584 -0.151870 -0.274044 -0.284084 -0.218473 0.392804 0.070805 0.423149 0.001571 -0.222539 -0.217948 -0.162154 0.158049 -0.161096 0.266381 0.267478 -0.247566 -0.164808 -0.130405 -0.167623 -0.182965 0.112155 0.118990 0.090496 0.107788 0.096355 0.096075 0.104141 0.100746 0.142664 0.149031 0.151351 0.151992 0.155657 0.149294 0.156223 0.160838 0.162426 0.161340
qa: -0.0519 -0.0575 -0.2096 -0.2827 -0.4484 -0.3374 -0.1003 0.1502 -0.0246 -0.1519 -0.2740 -0.2841 -0.2185 0.3928 0.0708 0.4231 0.0016 -0.2225 -0.2179 -0.1622 0.1580 -0.1611 0.2664 0.2675 -0.2476 -0.1648 -0.1304 -0.1676 -0.1830 0.1122 0.1190 0.0905 0.1078 0.0964 0.0961 0.1041 0.1007 0.1427 0.1490 0.1514 0.1520 0.1557 0.1493 0.1562 0.1608 0.1624 0.1613
va: 1.2771 1.2485 1.0814 2.1139 2.0559 2.0330 3.1091 3.7124 3.8856 3.8203 3.8845 3.9108 3.9027 4.1769 4.1911 3.6914 3.5980 4.0817 3.9844 3.9574 3.7181 3.9067 3.9953 3.6752 3.9935 3.8660 3.8962 3.9107 3.8898 1.0224 1.0224 1.0075 1.0029 1.0130 0.9984 0.9993 1.0034 1.0072 1.0127 1.0181 0.9985 0.9963 1.0072 1.0015 0.9882 0.9897 0.9889
dispcorr: -0.026171266 hartree
energy: -2149.948612302722
dipole: 0.95602 -1.67453 -0.71852 -32.83381 32.21945 -0.61436 -8.24455 7.15993 -1.08462
magnitude: 1.43879 au
magnitude: 3.65710 debye
