program: Orca
programVersion: 5.0.2
elementType: Cl Cl F O O O N C C C C C C C C C C C C C C C C C C C C C C H H H H H H H H H H H H H H H H H H
charge: 0
multiplicity: 1
keywords: wb97x-d3
keywords: def2-TZVPP
keywords: def2/J RIJCOSX
keywords: DEFGRID2
keywords: scfconv7
keywords: smallprint printgap noloewdin
keywords: NOSOSCF
formula: C22H18Cl2FNO3
InChI: InChI=1/C22H18Cl2FNO3/c1-22(2)15(11-19(23)24)20(22)21(27)29-18(12-26)13-8-9-16(25)17(10-13)28-14-6-4-3-5-7-14/h3-11,15,18,20H,1-2H3
47 atoms
Cl -4.2211 1.758518 -1.817573
Cl -5.447944 3.877586 -0.293042
F  4.638074 -2.895132 1.718387
O  0.664332 1.39552 -0.572332
O  1.589013 2.577329 1.076915
O  2.63194 -3.581197 0.160971
N  3.332958 3.252158 -1.660662
C  -1.55317 1.027616 1.621335
C  -2.008358 1.804266 0.416429
C  -0.744058 2.216448 1.139682
C  -1.050531 -0.377831 1.397309
C  -2.254634 1.2003 2.945989
C  -3.160344 2.71416 0.471287
C  0.608344 2.089077 0.570566
C  -4.135162 2.770068 -0.426834
C  1.942729 1.102194 -1.127777
C  2.707704 0.068243 -0.336503
C  2.715447 2.323717 -1.377945
C  2.288913 -1.254868 -0.460208
C  3.781576 0.385708 0.48131
C  2.932764 -2.259399 0.242711
C  4.441477 -0.618747 1.175437
C  4.009426 -1.918702 1.055986
C  1.382111 -3.96955 -0.274926
C  1.314412 -4.828485 -1.358757
C  0.236491 -3.558851 0.391713
C  0.072991 -5.286126 -1.781191
C  -0.997862 -4.010027 -0.051191
C  -1.084411 -4.873999 -1.135827
H  -1.865431 1.290876 -0.526653
H  -0.820949 3.091159 1.775937
H  -1.85982 -1.085862 1.583933
H  -0.697513 -0.552609 0.383366
H  -0.239364 -0.614458 2.088365
H  -3.15958 0.591422 2.979096
H  -1.60408 0.87042 3.757492
H  -2.534833 2.232441 3.151055
H  -3.22382 3.401725 1.306447
H  1.709368 0.692218 -2.113025
H  1.465775 -1.498525 -1.120994
H  4.129677 1.404213 0.582956
H  5.284375 -0.389021 1.813517
H  2.220241 -5.140862 -1.862398
H  0.304574 -2.897568 1.246439
H  0.014297 -5.96205 -2.624015
H  -1.894961 -3.688451 0.461432
H  -2.049618 -5.226862 -1.473367
elementType: Cl F O N C H
totalener: -2149.92231144 hartree
nucrepener: 2979.09478400 hartree
electener: -5129.01709544 hartree
oneelecener: -8870.50638339 hartree
twoeener: 3741.48928795 hartree
cpcmener: -0.04253776 hartree
kineticenergy: 2143.44963219 hartree
xcener: -159.162151178834 hartree
chargesum: 0.0000000
charge: -0.057789 -0.061117 -0.211056 -0.271789 -0.459262 -0.335310 -0.094517 0.104279 0.061079 -0.108176 -0.303770 -0.267252 -0.222411 0.439139 0.040782 0.433516 -0.026966 -0.235511 -0.258979 -0.162103 0.248274 -0.178241 0.204562 0.269603 -0.216617 -0.215336 -0.140600 -0.150938 -0.168051 0.086056 0.101962 0.109037 0.094268 0.111469 0.101317 0.100258 0.093340 0.135697 0.140271 0.154475 0.140455 0.153476 0.150574 0.184906 0.161951 0.163369 0.161678
qa: -0.0578 -0.0611 -0.2111 -0.2718 -0.4593 -0.3353 -0.0945 0.1043 0.0611 -0.1082 -0.3038 -0.2673 -0.2224 0.4391 0.0408 0.4335 -0.0270 -0.2355 -0.2590 -0.1621 0.2483 -0.1782 0.2046 0.2696 -0.2166 -0.2153 -0.1406 -0.1509 -0.1681 0.0861 0.1020 0.1090 0.0943 0.1115 0.1013 0.1003 0.0933 0.1357 0.1403 0.1545 0.1405 0.1535 0.1506 0.1849 0.1620 0.1634 0.1617
va: 1.2677 1.2444 1.0795 2.1426 2.0403 2.0760 3.1066 3.7712 3.8359 3.9184 3.9110 3.9027 3.8834 4.1364 4.2100 3.8665 3.7041 4.0581 3.9310 3.9105 3.6766 3.9488 4.0585 3.6885 3.9967 3.9286 3.8831 3.8907 3.9032 1.0395 1.0302 0.9970 1.0017 0.9960 1.0013 1.0010 1.0051 1.0157 0.9985 1.0021 1.0188 0.9981 1.0041 0.9769 0.9880 0.9905 0.9892
dispcorr: -0.026768593 hartree
energy: -2149.949080032513
dipole: 4.16233 -6.08213 -1.91980 -17.50144 15.53697 -1.96446 11.95518 -11.61485 0.34033
magnitude: 2.76778 au
magnitude: 7.03513 debye
