program: Orca
programVersion: 5.0.2
elementType: Cl Cl F O O O N C C C C C C C C C C C C C C C C C C C C C C H H H H H H H H H H H H H H H H H H
charge: 0
multiplicity: 1
keywords: wb97x-d3
keywords: def2-TZVPP
keywords: def2/J RIJCOSX
keywords: DEFGRID2
keywords: scfconv7
keywords: smallprint printgap noloewdin
keywords: NOSOSCF
formula: C22H18Cl2FNO3
InChI: InChI=1/C22H18Cl2FNO3/c1-22(2)15(11-19(23)24)20(22)21(27)29-18(12-26)13-8-9-16(25)17(10-13)28-14-6-4-3-5-7-14/h3-11,15,18,20H,1-2H3
47 atoms
Cl -5.377735 1.322845 0.185639
Cl -5.806115 4.165429 0.416982
F  4.208965 -2.745474 2.005616
O  1.027543 2.002736 -0.572592
O  -0.416767 0.296056 -0.53461
O  3.220315 -3.480429 -0.323563
N  3.786688 2.834938 -2.153053
C  -1.351242 2.006156 1.996099
C  -2.382766 2.003864 0.902146
C  -0.948835 2.356166 0.575594
C  -0.962108 0.67654 2.593959
C  -1.304821 3.136611 2.993794
C  -3.401222 3.055948 0.799394
C  -0.1355 1.426362 -0.225121
C  -4.679848 2.864655 0.501947
C  1.959081 1.186995 -1.273427
C  2.582292 0.136428 -0.386002
C  2.975042 2.119784 -1.762589
C  2.582715 -1.186867 -0.801607
C  3.137199 0.49392 0.836685
C  3.131562 -2.166344 0.012035
C  3.693105 -0.479803 1.650323
C  3.67845 -1.793346 1.232635
C  2.218319 -4.089476 -1.042484
C  0.873235 -3.805788 -0.842156
C  2.616327 -5.060875 -1.94895
C  -0.07645 -4.503549 -1.575714
C  1.654069 -5.757832 -2.665026
C  0.305633 -5.478542 -2.487518
H  -2.694401 1.015903 0.582621
H  -0.725818 3.404553 0.412148
H  -1.090644 -0.159499 1.911429
H  0.077943 0.690497 2.922467
H  -1.579793 0.477726 3.469649
H  -1.48145 4.112713 2.544683
H  -2.050149 2.98527 3.776174
H  -0.324832 3.170219 3.471377
H  -3.092148 4.078922 0.977673
H  1.494994 0.720761 -2.148824
H  2.152017 -1.452086 -1.759198
H  3.143539 1.525419 1.164037
H  4.129767 -0.223551 2.606503
H  0.558463 -3.053867 -0.129197
H  3.669582 -5.271867 -2.086605
H  -1.124883 -4.282199 -1.42481
H  1.964973 -6.517441 -3.370178
H  -0.442089 -6.018047 -3.053316
elementType: Cl F O N C H
totalener: -2149.92493166 hartree
nucrepener: 2902.28175928 hartree
electener: -5052.20669094 hartree
oneelecener: -8717.51247047 hartree
twoeener: 3665.30577953 hartree
cpcmener: -0.03848260 hartree
kineticenergy: 2143.45077231 hartree
xcener: -159.159202650404 hartree
chargesum: 0.0000000
charge: -0.057510 -0.061622 -0.210092 -0.274700 -0.459885 -0.333514 -0.100929 0.093544 0.029619 -0.072354 -0.264190 -0.265554 -0.202289 0.390123 0.038253 0.418431 -0.000039 -0.220259 -0.187076 -0.220629 0.230406 -0.159316 0.201808 0.299058 -0.200916 -0.256726 -0.145562 -0.118663 -0.189790 0.077523 0.103000 0.094014 0.097648 0.102790 0.092723 0.102298 0.098885 0.133528 0.141577 0.155269 0.151194 0.155334 0.161427 0.148642 0.162336 0.160959 0.161224
qa: -0.0575 -0.0616 -0.2101 -0.2747 -0.4599 -0.3335 -0.1009 0.0935 0.0296 -0.0724 -0.2642 -0.2656 -0.2023 0.3901 0.0383 0.4184 -0.0000 -0.2203 -0.1871 -0.2206 0.2304 -0.1593 0.2018 0.2991 -0.2009 -0.2567 -0.1456 -0.1187 -0.1898 0.0775 0.1030 0.0940 0.0976 0.1028 0.0927 0.1023 0.0989 0.1335 0.1416 0.1553 0.1512 0.1553 0.1614 0.1486 0.1623 0.1610 0.1612
va: 1.2680 1.2434 1.0812 2.1326 2.0469 2.0774 3.1098 3.7418 3.8821 3.8283 3.9078 3.9038 3.8942 4.2048 4.2097 3.7155 3.6230 4.0855 3.9401 3.9249 3.6866 3.8781 4.0664 3.6755 3.9058 4.0070 3.8880 3.8754 3.9057 1.0487 1.0312 1.0140 1.0008 1.0012 1.0057 1.0006 1.0012 1.0169 1.0174 1.0019 1.0093 0.9960 0.9961 1.0071 0.9894 0.9881 0.9893
dispcorr: -0.024367736 hartree
energy: -2149.949299397278
dipole: 13.78132 -14.47651 -0.69519 -9.44533 9.66468 0.21936 6.39197 -5.41731 0.97466
magnitude: 1.21711 au
magnitude: 3.09366 debye
