program: Orca
programVersion: 5.0.2
elementType: Cl Cl F O O O N C C C C C C C C C C C C C C C C C C C C C C H H H H H H H H H H H H H H H H H H
charge: 0
multiplicity: 1
keywords: wb97x-d3
keywords: def2-TZVPP
keywords: def2/J RIJCOSX
keywords: DEFGRID2
keywords: scfconv7
keywords: smallprint printgap noloewdin
keywords: NOSOSCF
formula: C22H18Cl2FNO3
InChI: InChI=1/C22H18Cl2FNO3/c1-22(2)15(11-19(23)24)20(22)21(27)29-18(12-26)13-8-9-16(25)17(10-13)28-14-6-4-3-5-7-14/h3-11,15,18,20H,1-2H3
47 atoms
Cl -2.556175 4.050898 1.161978
Cl -5.413125 3.673017 0.9702
F  4.855325 -2.711398 -1.819447
O  0.719691 1.037732 1.146987
O  0.638099 2.058475 -0.842603
O  2.308344 -3.117289 -1.341755
N  2.844281 0.889119 3.662446
C  -1.994039 0.268299 -0.941425
C  -2.33332 1.717595 -0.856521
C  -1.354651 1.143467 0.133863
C  -1.178065 -0.215685 -2.112763
C  -2.979186 -0.75172 -0.427764
C  -3.663678 2.168121 -0.391953
C  0.071095 1.486789 0.053327
C  -3.850767 3.164818 0.460069
C  2.128224 1.165038 1.16264
C  2.836231 0.120195 0.322048
C  2.510217 1.005608 2.567954
C  2.173469 -1.025535 -0.100683
C  4.175576 0.315443 0.020753
C  2.857077 -1.984356 -0.834328
C  4.865908 -0.645902 -0.701929
C  4.203706 -1.778552 -1.11617
C  1.071413 -3.548566 -0.911697
C  0.089595 -3.732024 -1.871919
C  0.836437 -3.84735 0.422909
C  -1.152319 -4.21861 -1.486829
C  -0.413359 -4.320465 0.795722
C  -1.409999 -4.506818 -0.154139
H  -1.892504 2.343423 -1.628945
H  -1.718836 0.96043 1.138176
H  -1.847463 -0.58424 -2.891922
H  -0.561424 0.562648 -2.557702
H  -0.527906 -1.042027 -1.821927
H  -3.705255 -1.00489 -1.202327
H  -2.461667 -1.670819 -0.147146
H  -3.527652 -0.400749 0.446547
H  -4.541131 1.672169 -0.790771
H  2.444685 2.167494 0.852875
H  1.128811 -1.179664 0.134453
H  4.687866 1.210355 0.349924
H  5.912702 -0.517124 -0.94352
H  0.294926 -3.498005 -2.9084
H  1.614246 -3.7126 1.164206
H  -1.921783 -4.363153 -2.233542
H  -0.60433 -4.550523 1.83552
H  -2.381052 -4.879093 0.143587
elementType: Cl F O N C H
totalener: -2149.92202079 hartree
nucrepener: 3034.02193493 hartree
electener: -5183.94395573 hartree
oneelecener: -8980.83965264 hartree
twoeener: 3796.89569691 hartree
cpcmener: -0.03758096 hartree
kineticenergy: 2143.45534126 hartree
xcener: -159.162862131100 hartree
chargesum: 0.0000000
charge: -0.051410 -0.057130 -0.213196 -0.288329 -0.452409 -0.331147 -0.099034 0.178201 -0.023958 -0.155540 -0.269916 -0.295231 -0.223157 0.397635 0.072978 0.407994 -0.006583 -0.229391 -0.209363 -0.225603 0.276613 -0.140575 0.180826 0.297685 -0.248234 -0.206140 -0.136331 -0.119972 -0.180760 0.112921 0.117520 0.107424 0.104723 0.070748 0.107178 0.086510 0.103039 0.141626 0.149477 0.146558 0.151716 0.153462 0.153701 0.160024 0.160884 0.162936 0.161030
qa: -0.0514 -0.0571 -0.2132 -0.2883 -0.4524 -0.3311 -0.0990 0.1782 -0.0240 -0.1555 -0.2699 -0.2952 -0.2232 0.3976 0.0730 0.4080 -0.0066 -0.2294 -0.2094 -0.2256 0.2766 -0.1406 0.1808 0.2977 -0.2482 -0.2061 -0.1363 -0.1200 -0.1808 0.1129 0.1175 0.1074 0.1047 0.0707 0.1072 0.0865 0.1030 0.1416 0.1495 0.1466 0.1517 0.1535 0.1537 0.1600 0.1609 0.1629 0.1610
va: 1.2775 1.2489 1.0752 2.1020 2.0511 2.0807 3.1152 3.6388 3.8926 3.8291 3.8715 3.9198 3.9112 4.1537 4.1883 3.6980 3.7408 4.0734 3.9261 3.9689 3.6398 3.8674 4.0490 3.6237 3.9550 3.9332 3.8192 3.8467 3.8550 1.0213 1.0249 1.0034 1.0204 1.0092 0.9991 1.0086 1.0006 1.0079 1.0163 1.0095 0.9992 0.9966 1.0043 0.9953 0.9890 0.9875 0.9899
dispcorr: -0.028753393 hartree
energy: -2149.950774185913
dipole: -2.39236 0.76775 -1.62461 -25.17434 24.34879 -0.82556 -11.33008 10.15365 -1.17643
magnitude: 2.16908 au
magnitude: 5.51335 debye
