program: Orca
programVersion: 5.0.2
elementType: Cl Cl F O O O N C C C C C C C C C C C C C C C C C C C C C C H H H H H H H H H H H H H H H H H H
charge: 0
multiplicity: 1
keywords: wb97x-d3
keywords: def2-TZVPP
keywords: def2/J RIJCOSX
keywords: DEFGRID2
keywords: scfconv7
keywords: smallprint printgap noloewdin
keywords: NOSOSCF
formula: C22H18Cl2FNO3
InChI: InChI=1/C22H18Cl2FNO3/c1-22(2)15(11-19(23)24)20(22)21(27)29-18(12-26)13-8-9-16(25)17(10-13)28-14-6-4-3-5-7-14/h3-11,15,18,20H,1-2H3
47 atoms
Cl -0.870426 0.063312 -2.523458
Cl -3.6154 -0.75571 -2.888444
F  3.411572 -3.053023 -1.094826
O  0.823984 2.258579 0.814916
O  1.180252 2.982309 -1.265131
O  1.63048 -2.886939 0.843901
N  2.673484 2.124264 3.542332
C  -2.120888 2.904347 0.492864
C  -1.876785 1.514908 0.018662
C  -1.051145 2.651285 -0.559279
C  -1.784535 3.272045 1.916883
C  -3.334942 3.636007 -0.030467
C  -2.83454 0.79156 -0.8444
C  0.409069 2.666681 -0.39145
C  -2.487611 0.125158 -1.935266
C  2.214144 2.001098 0.972719
C  2.569065 0.640899 0.427729
C  2.455631 2.074911 2.414229
C  1.907494 -0.480553 0.920325
C  3.514526 0.516682 -0.576718
C  2.191102 -1.730338 0.400502
C  3.81389 -0.737605 -1.092021
C  3.146448 -1.838248 -0.605829
C  0.321157 -2.887678 1.271449
C  0.037928 -3.565469 2.446152
C  -0.687049 -2.288895 0.528534
C  -1.278159 -3.647061 2.880383
C  -1.996324 -2.369543 0.980006
C  -2.29743 -3.046619 2.154911
H  -1.347578 0.869964 0.716797
H  -1.328846 2.969765 -1.557312
H  -2.68565 3.188352 2.526664
H  -1.032058 2.630189 2.366914
H  -1.439469 4.304874 1.983091
H  -3.187976 4.714761 0.038224
H  -3.553572 3.397735 -1.071901
H  -4.215889 3.383264 0.562041
H  -3.876787 0.768422 -0.546714
H  2.825083 2.775761 0.499703
H  1.17463 -0.381927 1.713218
H  4.022873 1.390605 -0.961545
H  4.548831 -0.855272 -1.877149
H  0.836675 -4.028432 3.011197
H  -0.460257 -1.772855 -0.395597
H  -1.502262 -4.178692 3.795676
H  -2.784267 -1.907098 0.399818
H  -3.320908 -3.109345 2.499058
elementType: Cl F O N C H
totalener: -2149.92025601 hartree
nucrepener: 3160.47913552 hartree
electener: -5310.39939153 hartree
oneelecener: -9233.70505178 hartree
twoeener: 3923.30566024 hartree
cpcmener: -0.03777731 hartree
kineticenergy: 2143.46918109 hartree
xcener: -159.163474824523 hartree
chargesum: 0.0000000
charge: -0.059752 -0.059145 -0.209486 -0.272952 -0.464964 -0.336826 -0.098208 0.147527 -0.005187 -0.124373 -0.271424 -0.288387 -0.272473 0.393735 0.126883 0.406153 0.018539 -0.230795 -0.193102 -0.180823 0.188608 -0.153986 0.192538 0.259238 -0.235629 -0.175060 -0.128069 -0.144707 -0.188997 0.113062 0.113754 0.095365 0.090807 0.103511 0.101718 0.095503 0.103238 0.144435 0.141730 0.155013 0.153081 0.154663 0.149544 0.155873 0.161731 0.166943 0.161149
qa: -0.0598 -0.0591 -0.2095 -0.2730 -0.4650 -0.3368 -0.0982 0.1475 -0.0052 -0.1244 -0.2714 -0.2884 -0.2725 0.3937 0.1269 0.4062 0.0185 -0.2308 -0.1931 -0.1808 0.1886 -0.1540 0.1925 0.2592 -0.2356 -0.1751 -0.1281 -0.1447 -0.1890 0.1131 0.1138 0.0954 0.0908 0.1035 0.1017 0.0955 0.1032 0.1444 0.1417 0.1550 0.1531 0.1547 0.1495 0.1559 0.1617 0.1669 0.1611
va: 1.2716 1.2446 1.0822 2.1234 2.0349 2.0748 3.1060 3.7334 3.8173 3.8704 3.8965 3.9276 3.8895 4.1431 4.1139 3.7486 3.6175 4.0785 3.9260 3.9214 3.7375 3.8759 4.0693 3.7583 3.9933 3.8750 3.8811 3.8556 3.9401 1.0043 1.0202 1.0010 1.0115 0.9997 1.0020 0.9978 0.9997 1.0112 1.0166 1.0071 1.0019 0.9961 1.0053 1.0133 0.9871 0.9907 0.9900
dispcorr: -0.030442572 hartree
energy: -2149.950698583708
dipole: -13.14031 11.22651 -1.91381 17.04059 -16.23890 0.80169 21.19953 -21.08989 0.10963
magnitude: 2.07783 au
magnitude: 5.28143 debye
