program: Orca
programVersion: 5.0.2
elementType: Cl F F F O O O N C C C C C C C C C C C C C C C C C C C C C C C H H H H H H H H H H H H H H H H H H H
charge: 0
multiplicity: 1
keywords: wb97x-d3
keywords: def2-TZVPP
keywords: def2/J RIJCOSX
keywords: DEFGRID2
keywords: scfconv7
keywords: smallprint printgap noloewdin
keywords: NOSOSCF
formula: C23H19ClF3NO3
InChI: InChI=1/C23H19ClF3NO3/c1-22(2)17(12-19(24)23(25,26)27)20(22)21(29)31-18(13-28)14-7-6-10-16(11-14)30-15-8-4-3-5-9-15/h3-12,17-18,20H,1-2H3
50 atoms
Cl 4.264926 -2.632144 -2.738906
F  4.803049 -4.935201 0.340759
F  6.165289 -3.486277 -0.486284
F  5.501173 -5.139555 -1.684795
O  -0.04486 -0.083869 1.212307
O  0.208172 0.102544 -1.006298
O  -4.662498 3.535867 -0.178573
N  -0.125714 2.144905 3.667302
C  0.245499 -3.042636 -0.794899
C  1.645827 -2.526642 -0.97941
C  0.764419 -1.946962 0.109876
C  -0.758811 -2.740518 -1.880068
C  0.018507 -4.386821 -0.142475
C  2.81083 -3.320467 -0.580997
C  0.294458 -0.550585 -0.006164
C  3.952933 -3.433826 -1.248693
C  -0.597897 1.21729 1.269737
C  5.112748 -4.255896 -0.766383
C  -2.090476 1.225716 1.01888
C  -0.320315 1.716258 2.619647
C  -2.664148 2.376965 0.502124
C  -2.877175 0.131572 1.34986
C  -4.041748 2.443077 0.33487
C  -4.24668 0.1982 1.144772
C  -4.836051 1.348203 0.648014
C  -4.20429 4.789441 0.123515
C  -3.831988 5.147006 1.413602
C  -4.177538 5.721567 -0.902436
C  -3.422314 6.447168 1.664743
C  -3.777631 7.021749 -0.63342
C  -3.392606 7.389234 0.646737
H  1.783413 -1.883178 -1.840771
H  0.984408 -2.255269 1.125842
H  -0.564087 -1.804934 -2.397646
H  -0.741468 -3.540792 -2.621097
H  -1.768367 -2.692508 -1.46839
H  -1.00818 -4.457959 0.218619
H  0.17583 -5.192917 -0.860271
H  0.671419 -4.56952 0.709793
H  2.737451 -3.870605 0.348254
H  -0.10252 1.8816 0.553312
H  -2.041936 3.223046 0.234911
H  -2.435612 -0.762902 1.766917
H  -4.868058 -0.651401 1.394056
H  -5.906457 1.406955 0.502815
H  -3.862924 4.423206 2.218097
H  -4.475263 5.426942 -1.900037
H  -3.130825 6.723958 2.669184
H  -3.760982 7.748361 -1.43483
H  -3.07546 8.402592 0.851499
totalener: -1928.16462600 hartree
nucrepener: 3021.18985573 hartree
electener: -4949.35448173 hartree
oneelecener: -8648.95631410 hartree
twoeener: 3699.60183238 hartree
kineticenergy: 1921.67111208 hartree
xcener: -157.119444204886 hartree
chargesum: 0.0000000
charge: -0.046104 -0.170411 -0.158468 -0.159205 -0.274924 -0.358111 -0.297278 0.001156 0.061650 0.036103 -0.092531 -0.240209 -0.243063 -0.154232 0.324259 -0.077566 0.303212 0.506777 0.092790 -0.250903 -0.187545 -0.193911 0.216057 -0.095660 -0.186985 0.241930 -0.168312 -0.210580 -0.110974 -0.089218 -0.144360 0.090551 0.085212 0.104703 0.093271 0.086488 0.093851 0.102662 0.076377 0.115213 0.127860 0.117803 0.124796 0.127870 0.130300 0.137081 0.126442 0.131576 0.126970 0.127587
qa: -0.0461 -0.1704 -0.1585 -0.1592 -0.2749 -0.3581 -0.2973 0.0012 0.0617 0.0361 -0.0925 -0.2402 -0.2431 -0.1542 0.3243 -0.0776 0.3032 0.5068 0.0928 -0.2509 -0.1875 -0.1939 0.2161 -0.0957 -0.1870 0.2419 -0.1683 -0.2106 -0.1110 -0.0892 -0.1444 0.0906 0.0852 0.1047 0.0933 0.0865 0.0939 0.1027 0.0764 0.1152 0.1279 0.1178 0.1248 0.1279 0.1303 0.1371 0.1264 0.1316 0.1270 0.1276
va: 1.2895 1.1319 1.1467 1.1476 2.1104 2.1464 2.1145 3.1211 3.7792 3.8228 3.8591 3.9121 3.9082 3.8887 4.2600 4.0705 3.8270 4.4796 3.6656 4.0058 4.0055 4.0025 3.8773 3.9519 4.0349 3.7952 3.9454 4.0419 3.9493 3.9316 3.9637 1.0510 1.0365 1.0206 1.0016 1.0036 1.0048 1.0023 1.0104 1.0300 1.0237 1.0131 1.0187 1.0000 1.0110 1.0028 1.0136 0.9990 0.9986 1.0000
dispcorr: -0.024191332 hartree
energy: -1928.188817332460
dipole: -50.30577 48.81253 -1.49325 23.38912 -23.82913 -0.44002 6.10076 -6.58275 -0.48198
magnitude: 1.62963 au
magnitude: 4.14220 debye
