program: Orca
programVersion: 5.0.2
elementType: Cl F F F O O O N C C C C C C C C C C C C C C C C C C C C C C C H H H H H H H H H H H H H H H H H H H
charge: 0
multiplicity: 1
keywords: wb97x-d3
keywords: def2-TZVPP
keywords: def2/J RIJCOSX
keywords: DEFGRID2
keywords: scfconv7
keywords: smallprint printgap noloewdin
keywords: NOSOSCF
formula: C23H19ClF3NO3
InChI: InChI=1/C23H19ClF3NO3/c1-22(2)17(12-19(24)23(25,26)27)20(22)21(29)31-18(13-28)14-7-6-10-16(11-14)30-15-8-4-3-5-9-15/h3-12,17-18,20H,1-2H3
50 atoms
Cl 2.558371 -4.740717 -1.548128
F  5.524206 -4.23181 -1.174361
F  5.365135 -2.084118 -1.18784
F  4.767051 -3.225169 -2.912835
O  -0.905055 0.179689 -0.857333
O  -1.474778 -1.91649 -0.314136
O  -3.785436 3.809586 1.767275
N  -1.925981 2.147689 -3.319092
C  1.038357 -1.777659 1.540227
C  1.440453 -2.395693 0.232988
C  0.693779 -1.069153 0.250983
C  -0.027566 -2.482744 2.344678
C  2.070331 -1.101461 2.411969
C  2.815267 -2.384908 -0.269381
C  -0.671663 -1.024791 -0.310622
C  3.372916 -3.311611 -1.039753
C  -2.204813 0.394855 -1.402111
C  4.768236 -3.212027 -1.580402
C  -3.158795 0.876195 -0.338532
C  -2.032094 1.379377 -2.472191
C  -2.999917 2.150251 0.196727
C  -4.15062 0.029621 0.12834
C  -3.849786 2.575606 1.206423
C  -5.001363 0.471924 1.132386
C  -4.855052 1.734084 1.675323
C  -2.648914 4.560936 1.620916
C  -2.730458 5.754714 0.923986
C  -1.453506 4.154359 2.198529
C  -1.601744 6.55392 0.810236
C  -0.331176 4.956753 2.070778
C  -0.400577 6.157187 1.37716
H  0.8377 -3.244471 -0.068669
H  1.287756 -0.188171 0.036146
H  0.445245 -3.178933 3.03883
H  -0.601915 -1.766279 2.934185
H  -0.725493 -3.044703 1.730822
H  1.581918 -0.403386 3.092975
H  2.601939 -1.837845 3.01604
H  2.811917 -0.534918 1.850032
H  3.42841 -1.528985 -0.017599
H  -2.586829 -0.525293 -1.854258
H  -2.228001 2.807234 -0.185654
H  -4.254302 -0.966816 -0.279027
H  -5.782224 -0.179117 1.501542
H  -5.515505 2.081562 2.458742
H  -3.670683 6.053832 0.480047
H  -1.404852 3.221415 2.745592
H  -1.663122 7.487536 0.267348
H  0.601662 4.643669 2.520612
H  0.477613 6.781098 1.281569
totalener: -1928.16548292 hartree
nucrepener: 3089.21689016 hartree
electener: -5017.38237307 hartree
oneelecener: -8785.13645221 hartree
twoeener: 3767.75407914 hartree
kineticenergy: 1921.68931887 hartree
xcener: -157.121742815406 hartree
chargesum: 0.0000000
charge: -0.047196 -0.159633 -0.170614 -0.157842 -0.260866 -0.380833 -0.294624 0.000159 0.059270 0.023341 -0.090280 -0.243775 -0.245005 -0.146560 0.363889 -0.078570 0.323572 0.506008 -0.014770 -0.264962 -0.162913 -0.137499 0.218453 -0.088694 -0.200442 0.207664 -0.165447 -0.155673 -0.106229 -0.117005 -0.124020 0.091461 0.085115 0.090750 0.089423 0.103991 0.094918 0.100274 0.075487 0.115162 0.121270 0.130444 0.117982 0.128616 0.128811 0.127541 0.127209 0.128690 0.125765 0.128187
qa: -0.0472 -0.1596 -0.1706 -0.1578 -0.2609 -0.3808 -0.2946 0.0002 0.0593 0.0233 -0.0903 -0.2438 -0.2450 -0.1466 0.3639 -0.0786 0.3236 0.5060 -0.0148 -0.2650 -0.1629 -0.1375 0.2185 -0.0887 -0.2004 0.2077 -0.1654 -0.1557 -0.1062 -0.1170 -0.1240 0.0915 0.0851 0.0908 0.0894 0.1040 0.0949 0.1003 0.0755 0.1152 0.1213 0.1304 0.1180 0.1286 0.1288 0.1275 0.1272 0.1287 0.1258 0.1282
va: 1.2886 1.1466 1.1318 1.1483 2.1411 2.1224 2.1146 3.1163 3.7787 3.8183 3.8736 3.9144 3.9113 3.8940 4.2277 4.0744 3.8321 4.4805 3.7038 4.0316 3.9615 3.9857 3.8718 3.9569 4.0296 3.8443 4.0347 3.9796 3.9443 3.9447 3.9532 1.0506 1.0362 1.0011 1.0022 1.0218 1.0036 1.0030 1.0107 1.0304 1.0195 1.0173 1.0196 0.9992 1.0121 1.0111 1.0053 0.9994 1.0001 0.9999
dispcorr: -0.024310223 hartree
energy: -1928.189793137979
dipole: -31.04779 30.75389 -0.29389 29.77521 -29.50160 0.27360 30.43599 -28.45442 1.98157
magnitude: 2.02185 au
magnitude: 5.13913 debye
