program: Orca
programVersion: 5.0.2
elementType: Cl F F F O O O N C C C C C C C C C C C C C C C C C C C C C C C H H H H H H H H H H H H H H H H H H H
charge: 0
multiplicity: 1
keywords: wb97x-d3
keywords: def2-TZVPP
keywords: def2/J RIJCOSX
keywords: DEFGRID2
keywords: scfconv7
keywords: smallprint printgap noloewdin
keywords: NOSOSCF
formula: C23H19ClF3NO3
InChI: InChI=1/C23H19ClF3NO3/c1-22(2)17(12-19(24)23(25,26)27)20(22)21(29)31-18(13-28)14-7-6-10-16(11-14)30-15-8-4-3-5-9-15/h3-12,17-18,20H,1-2H3
50 atoms
Cl 4.931992 -2.855798 0.855024
F  3.668972 -5.892408 -1.205491
F  4.479725 -5.795764 0.788097
F  5.697636 -5.24341 -0.893706
O  -1.123534 -1.209334 -0.062861
O  0.633585 -0.083436 0.745631
O  -2.862915 4.189631 1.636488
N  -4.158425 -1.900291 1.053943
C  1.940045 -1.097926 -1.951341
C  2.422321 -1.909589 -0.782553
C  0.935183 -1.703943 -0.996042
C  2.217051 0.385702 -1.931256
C  1.972679 -1.68426 -3.343022
C  2.953299 -3.268016 -0.921953
C  0.185174 -0.896861 -0.01121
C  3.990677 -3.768086 -0.261153
C  -1.977708 -0.482436 0.804579
C  4.461547 -5.185558 -0.396596
C  -2.305962 0.89391 0.272928
C  -3.194611 -1.288409 0.928344
C  -2.436592 1.943391 1.165298
C  -2.518076 1.093841 -1.085218
C  -2.780591 3.207536 0.703289
C  -2.839624 2.36267 -1.5363
C  -2.97268 3.425126 -0.655534
C  -3.647361 5.286493 1.402826
C  -3.070971 6.538729 1.541082
C  -4.994813 5.155306 1.091552
C  -3.852954 7.671545 1.367802
C  -5.762163 6.294706 0.911352
C  -5.196555 7.555153 1.046591
H  2.844358 -1.324178 0.026133
H  0.381063 -2.548929 -1.389463
H  2.255756 0.800105 -0.927279
H  3.176524 0.583907 -2.411108
H  1.450389 0.927297 -2.488079
H  2.967963 -1.580936 -3.777566
H  1.705833 -2.739912 -3.375136
H  1.27168 -1.155009 -3.989696
H  2.440478 -3.935573 -1.602947
H  -1.529635 -0.392332 1.800027
H  -2.268407 1.79627 2.225293
H  -2.434182 0.274025 -1.785766
H  -2.99301 2.533223 -2.593484
H  -3.220885 4.409731 -1.028777
H  -2.020957 6.620039 1.78942
H  -5.440828 4.173351 0.996129
H  -3.404278 8.649607 1.479881
H  -6.812161 6.194127 0.670576
H  -5.802046 8.440336 0.907614
totalener: -1928.16468782 hartree
nucrepener: 2997.82307316 hartree
electener: -4925.98776097 hartree
oneelecener: -8602.31886680 hartree
twoeener: 3676.33110583 hartree
kineticenergy: 1921.68044279 hartree
xcener: -157.119988681513 hartree
chargesum: -0.0000000
charge: -0.047049 -0.169894 -0.158173 -0.159706 -0.270653 -0.357910 -0.294021 0.001470 0.054298 0.035170 -0.085637 -0.237938 -0.237546 -0.153631 0.320439 -0.078725 0.302495 0.506502 0.076957 -0.249355 -0.187024 -0.198379 0.209847 -0.114081 -0.148112 0.218466 -0.190360 -0.157275 -0.100805 -0.116650 -0.133176 0.091812 0.086385 0.103541 0.091977 0.086703 0.100679 0.074511 0.094891 0.116724 0.124542 0.107764 0.125503 0.128944 0.135475 0.127878 0.137507 0.127700 0.129887 0.128033
qa: -0.0470 -0.1699 -0.1582 -0.1597 -0.2707 -0.3579 -0.2940 0.0015 0.0543 0.0352 -0.0856 -0.2379 -0.2375 -0.1536 0.3204 -0.0787 0.3025 0.5065 0.0770 -0.2494 -0.1870 -0.1984 0.2098 -0.1141 -0.1481 0.2185 -0.1904 -0.1573 -0.1008 -0.1167 -0.1332 0.0918 0.0864 0.1035 0.0920 0.0867 0.1007 0.0745 0.0949 0.1167 0.1245 0.1078 0.1255 0.1289 0.1355 0.1279 0.1375 0.1277 0.1299 0.1280
va: 1.2884 1.1332 1.1490 1.1451 2.1173 2.1470 2.1109 3.1211 3.7913 3.8096 3.8552 3.9132 3.9077 3.8899 4.2649 4.0683 3.8365 4.4819 3.6704 4.0095 4.1051 4.0141 3.9108 3.9648 3.9327 3.8188 4.0347 3.9619 3.9356 3.9427 3.9527 1.0519 1.0358 1.0207 1.0019 1.0034 1.0028 1.0102 1.0041 1.0282 1.0211 1.0257 1.0194 1.0011 1.0042 1.0121 1.0017 0.9989 0.9994 0.9998
dispcorr: -0.023904135 hartree
energy: -1928.188591952769
dipole: -35.58495 35.50109 -0.08386 49.45512 -47.63301 1.82211 -14.71626 13.30624 -1.41002
magnitude: 2.30549 au
magnitude: 5.86008 debye
