program: Orca
programVersion: 5.0.2
elementType: Cl F F F O O O N C C C C C C C C C C C C C C C C C C C C C C C H H H H H H H H H H H H H H H H H H H
charge: 0
multiplicity: 1
keywords: wb97x-d3
keywords: def2-TZVPP
keywords: def2/J RIJCOSX
keywords: DEFGRID2
keywords: scfconv7
keywords: smallprint printgap noloewdin
keywords: NOSOSCF
formula: C23H19ClF3NO3
InChI: InChI=1/C23H19ClF3NO3/c1-22(2)17(12-19(24)23(25,26)27)20(22)21(29)31-18(13-28)14-7-6-10-16(11-14)30-15-8-4-3-5-9-15/h3-12,17-18,20H,1-2H3
50 atoms
Cl 2.766443 -4.567853 -1.554972
F  5.375748 -1.720148 -1.167617
F  4.922417 -2.949822 -2.876831
F  5.685395 -3.849159 -1.080251
O  -0.996703 0.177888 -0.912856
O  -1.502715 -1.92061 -0.321488
O  -3.458197 3.451552 2.273254
N  -2.218251 2.207618 -3.227923
C  1.024361 -1.704391 1.49316
C  1.459789 -2.277247 0.175854
C  0.642712 -0.994093 0.215889
C  0.004578 -2.484012 2.288077
C  2.02475 -0.991357 2.373227
C  2.83755 -2.18316 -0.306709
C  -0.725373 -1.007487 -0.34012
C  3.472011 -3.08188 -1.049326
C  -2.329043 0.368593 -1.375802
C  4.874693 -2.898467 -1.545877
C  -3.225684 0.795109 -0.240825
C  -2.248735 1.399568 -2.412494
C  -2.910538 1.956852 0.456571
C  -4.310145 0.018816 0.125303
C  -3.700607 2.344156 1.527227
C  -5.09681 0.420013 1.198152
C  -4.800534 1.573203 1.898544
C  -2.512903 4.346267 1.838659
C  -1.280375 4.381226 2.469776
C  -2.804437 5.212172 0.795007
C  -0.328841 5.300221 2.05067
C  -1.844359 6.121622 0.380736
C  -0.605211 6.166933 1.004239
H  0.907194 -3.153773 -0.142197
H  1.188771 -0.079283 0.0153
H  0.522027 -3.165881 2.964541
H  -0.605216 -1.813389 2.895345
H  -0.664285 -3.072257 1.666878
H  2.712819 -0.351987 1.821245
H  1.503804 -0.356381 3.09084
H  2.61953 -1.711926 2.936397
H  3.388854 -1.286285 -0.05514
H  -2.71505 -0.545606 -1.837089
H  -2.054647 2.549788 0.1588
H  -4.535225 -0.894666 -0.40865
H  -5.94843 -0.177681 1.493759
H  -5.411347 1.88735 2.734583
H  -1.074095 3.697648 3.282955
H  -3.771737 5.17092 0.310921
H  0.634125 5.333103 2.542818
H  -2.066207 6.795838 -0.435507
H  0.140947 6.877926 0.676469
totalener: -1928.16521369 hartree
nucrepener: 3101.28405327 hartree
electener: -5029.44926696 hartree
oneelecener: -8809.34484386 hartree
twoeener: 3779.89557690 hartree
kineticenergy: 1921.69992054 hartree
xcener: -157.123481078357 hartree
chargesum: 0.0000000
charge: -0.047093 -0.170548 -0.158164 -0.159764 -0.268210 -0.372333 -0.295787 -0.000410 0.066280 0.025863 -0.089151 -0.244094 -0.247413 -0.148518 0.348387 -0.079600 0.331114 0.506309 -0.002195 -0.264119 -0.187811 -0.147313 0.243227 -0.078318 -0.207367 0.205787 -0.163240 -0.145973 -0.121560 -0.116851 -0.116152 0.092048 0.083847 0.090462 0.090144 0.103942 0.075837 0.095176 0.101167 0.115179 0.120826 0.124067 0.112940 0.127981 0.128118 0.124110 0.132211 0.127187 0.130952 0.128822
qa: -0.0471 -0.1705 -0.1582 -0.1598 -0.2682 -0.3723 -0.2958 -0.0004 0.0663 0.0259 -0.0892 -0.2441 -0.2474 -0.1485 0.3484 -0.0796 0.3311 0.5063 -0.0022 -0.2641 -0.1878 -0.1473 0.2432 -0.0783 -0.2074 0.2058 -0.1632 -0.1460 -0.1216 -0.1169 -0.1162 0.0920 0.0838 0.0905 0.0901 0.1039 0.0758 0.0952 0.1012 0.1152 0.1208 0.1241 0.1129 0.1280 0.1281 0.1241 0.1322 0.1272 0.1310 0.1288
va: 1.2888 1.1318 1.1484 1.1458 2.1351 2.1313 2.1198 3.1187 3.7645 3.8253 3.8744 3.9132 3.9119 3.8919 4.2412 4.0744 3.8383 4.4794 3.7064 4.0291 3.9507 4.0056 3.8420 3.9498 4.0381 3.8406 4.0128 3.9938 3.9427 3.9521 3.9426 1.0487 1.0363 1.0006 1.0022 1.0223 1.0105 1.0040 1.0022 1.0305 1.0210 1.0276 1.0160 0.9991 1.0127 1.0105 1.0051 0.9997 0.9996 0.9999
dispcorr: -0.024532040 hartree
energy: -1928.189745730962
dipole: -32.63901 32.29496 -0.34406 28.06231 -27.76687 0.29543 29.10349 -27.29583 1.80766
magnitude: 1.86367 au
magnitude: 4.73708 debye
