program: Orca
programVersion: 5.0.2
elementType: Cl F F F O O O N C C C C C C C C C C C C C C C C C C C C C C C H H H H H H H H H H H H H H H H H H H
charge: 0
multiplicity: 1
keywords: wb97x-d3
keywords: def2-TZVPP
keywords: def2/J RIJCOSX
keywords: DEFGRID2
keywords: scfconv7
keywords: smallprint printgap noloewdin
keywords: NOSOSCF
formula: C23H19ClF3NO3
InChI: InChI=1/C23H19ClF3NO3/c1-22(2)17(12-19(24)23(25,26)27)20(22)21(29)31-18(13-28)14-7-6-10-16(11-14)30-15-8-4-3-5-9-15/h3-12,17-18,20H,1-2H3
50 atoms
Cl 4.43205 -2.869369 1.274268
F  3.877552 -5.497547 -1.523992
F  4.310878 -5.759855 0.56806
F  5.7371 -4.779809 -0.70619
O  -1.459092 -1.201522 -0.593758
O  0.04654 -0.346167 0.823241
O  -1.992503 4.035344 1.370786
N  -4.644171 -2.038084 -0.337479
C  1.91567 -0.742563 -1.689593
C  2.190578 -1.762912 -0.620535
C  0.773821 -1.550682 -1.111922
C  2.091113 0.711668 -1.325432
C  2.281844 -1.040329 -3.124339
C  2.850926 -3.04019 -0.898679
C  -0.205919 -0.959335 -0.176737
C  3.797484 -3.596624 -0.152003
C  -2.506742 -0.630867 0.186937
C  4.433619 -4.918485 -0.457967
C  -2.708649 0.827834 -0.143228
C  -3.698255 -1.425556 -0.117015
C  -2.308479 1.791649 0.769906
C  -3.255197 1.203936 -1.364278
C  -2.454496 3.136239 0.461097
C  -3.39545 2.549339 -1.661787
C  -2.996323 3.521919 -0.75838
C  -2.714133 5.162745 1.644177
C  -4.099476 5.148463 1.748335
C  -2.000931 6.329509 1.876122
C  -4.766135 6.317827 2.079864
C  -2.680674 7.488534 2.21645
C  -4.064107 7.490765 2.314544
H  2.390601 -1.341946 0.357921
H  0.361933 -2.304372 -1.774113
H  1.438062 1.342041 -1.931407
H  1.880473 0.918553 -0.279509
H  3.120407 1.014071 -1.523416
H  3.340365 -0.840591 -3.296866
H  2.088642 -2.072395 -3.414955
H  1.708704 -0.402597 -3.798446
H  2.533989 -3.587849 -1.777451
H  -2.292808 -0.744928 1.254293
H  -1.867247 1.509715 1.716975
H  -3.579168 0.455418 -2.07625
H  -3.819809 2.848608 -2.610618
H  -3.106545 4.570758 -1.001832
H  -4.655534 4.234878 1.581094
H  -0.921912 6.320259 1.796471
H  -5.844778 6.305165 2.163139
H  -2.1221 8.396639 2.400488
H  -4.591095 8.397872 2.576867
totalener: -1928.16556003 hartree
nucrepener: 3022.36826352 hartree
electener: -4950.53382355 hartree
oneelecener: -8651.45628784 hartree
twoeener: 3700.92246429 hartree
kineticenergy: 1921.68952895 hartree
xcener: -157.121732412336 hartree
chargesum: -0.0000000
charge: -0.047342 -0.169836 -0.158544 -0.160027 -0.255506 -0.378120 -0.295799 -0.000098 0.055264 0.038224 -0.098174 -0.245861 -0.238638 -0.156375 0.363235 -0.076470 0.313843 0.505872 -0.000975 -0.259054 -0.136539 -0.164016 0.170556 -0.114812 -0.136571 0.232324 -0.150265 -0.207643 -0.122692 -0.093110 -0.141374 0.091096 0.085260 0.089889 0.102952 0.092539 0.101051 0.073666 0.095874 0.118357 0.122268 0.119591 0.123340 0.132270 0.137103 0.133567 0.126958 0.129040 0.126543 0.127160
qa: -0.0473 -0.1698 -0.1585 -0.1600 -0.2555 -0.3781 -0.2958 -0.0001 0.0553 0.0382 -0.0982 -0.2459 -0.2386 -0.1564 0.3632 -0.0765 0.3138 0.5059 -0.0010 -0.2591 -0.1365 -0.1640 0.1706 -0.1148 -0.1366 0.2323 -0.1503 -0.2076 -0.1227 -0.0931 -0.1414 0.0911 0.0853 0.0899 0.1030 0.0925 0.1011 0.0737 0.0959 0.1184 0.1223 0.1196 0.1233 0.1323 0.1371 0.1336 0.1270 0.1290 0.1265 0.1272
va: 1.2880 1.1334 1.1490 1.1443 2.1413 2.1270 2.1067 3.1179 3.7911 3.7924 3.8847 3.9157 3.9065 3.8890 4.2347 4.0657 3.8313 4.4836 3.6432 4.0206 4.0257 4.0299 3.9371 3.9521 3.9542 3.8081 3.9257 4.0327 3.9542 3.9408 3.9592 1.0528 1.0350 1.0020 1.0197 1.0017 1.0025 1.0104 1.0043 1.0269 1.0155 1.0339 1.0160 1.0006 1.0015 1.0038 1.0134 0.9998 0.9986 1.0000
dispcorr: -0.024057251 hartree
energy: -1928.189617283674
dipole: -32.17482 32.20574 0.03092 50.83634 -48.92040 1.91594 -9.83550 8.92093 -0.91457
magnitude: 2.12326 au
magnitude: 5.39690 debye
