program: Orca
programVersion: 5.0.2
elementType: Cl F F F O O O N C C C C C C C C C C C C C C C C C C C C C C C H H H H H H H H H H H H H H H H H H H
charge: 0
multiplicity: 1
keywords: wb97x-d3
keywords: def2-TZVPP
keywords: def2/J RIJCOSX
keywords: DEFGRID2
keywords: scfconv7
keywords: smallprint printgap noloewdin
keywords: NOSOSCF
formula: C23H19ClF3NO3
InChI: InChI=1/C23H19ClF3NO3/c1-22(2)17(12-19(24)23(25,26)27)20(22)21(29)31-18(13-28)14-7-6-10-16(11-14)30-15-8-4-3-5-9-15/h3-12,17-18,20H,1-2H3
50 atoms
Cl 1.328755 -0.230296 -0.988879
F  4.808722 -1.063031 0.514579
F  3.642965 0.733847 0.71475
F  4.312216 0.104986 -1.226063
O  -1.858294 -1.344046 0.403284
O  -1.817024 -3.23886 -0.77924
O  -1.71251 3.698985 0.839309
N  -2.525805 -0.621222 -2.867599
C  0.613237 -4.069197 0.99362
C  1.166372 -3.14031 -0.033581
C  -0.051881 -2.727977 0.773179
C  -0.038847 -5.353072 0.539517
C  1.3416 -4.205863 2.310588
C  2.425874 -2.386551 0.151663
C  -1.320846 -2.524372 0.045398
C  2.585054 -1.125715 -0.231277
C  -2.997059 -0.890736 -0.306546
C  3.848855 -0.335066 -0.056776
C  -3.342484 0.47777 0.226807
C  -2.71617 -0.780671 -1.746037
C  -2.334506 1.431657 0.303162
C  -4.64021 0.787965 0.591866
C  -2.637769 2.713178 0.733449
C  -4.929297 2.072693 1.036571
C  -3.941016 3.035457 1.105647
C  -0.51001 3.565205 0.191928
C  0.646596 3.553061 0.953045
C  -0.451012 3.481174 -1.192896
C  1.877303 3.454822 0.320167
C  0.783762 3.370311 -1.812092
C  1.950048 3.353895 -1.059918
H  0.948126 -3.401667 -1.066424
H  0.135498 -1.985918 1.540849
H  0.709218 -6.146627 0.50252
H  -0.812564 -5.663017 1.243473
H  -0.496374 -5.276016 -0.442415
H  1.784769 -3.268334 2.648513
H  0.656098 -4.542794 3.0892
H  2.141011 -4.945196 2.233882
H  3.265892 -2.895461 0.609804
H  -3.837553 -1.580661 -0.178286
H  -1.321375 1.171999 0.025113
H  -5.423506 0.043437 0.529527
H  -5.940187 2.326759 1.325413
H  -4.16524 4.038586 1.443378
H  0.579071 3.622602 2.030703
H  -1.360269 3.494092 -1.780416
H  2.781604 3.44821 0.912787
H  0.831823 3.294253 -2.890158
H  2.910253 3.260433 -1.548511
totalener: -1928.15904472 hartree
nucrepener: 3356.02537507 hartree
electener: -5284.18441979 hartree
oneelecener: -9319.52610867 hartree
twoeener: 4035.34168888 hartree
kineticenergy: 1921.68854194 hartree
xcener: -157.122534028489 hartree
chargesum: 0.0000000
charge: -0.038880 -0.167327 -0.162633 -0.163027 -0.261237 -0.355403 -0.294835 -0.000999 0.135836 -0.057813 -0.149908 -0.249002 -0.270762 -0.173373 0.346345 -0.021193 0.327341 0.508913 0.041932 -0.261384 -0.149744 -0.180218 0.234208 -0.075758 -0.216331 0.241650 -0.176057 -0.170541 -0.090634 -0.111821 -0.156437 0.121976 0.102693 0.084148 0.088567 0.105866 0.086017 0.096228 0.096600 0.137390 0.107571 0.083860 0.111010 0.125984 0.127399 0.122943 0.135372 0.125314 0.132258 0.127898
qa: -0.0389 -0.1673 -0.1626 -0.1630 -0.2612 -0.3554 -0.2948 -0.0010 0.1358 -0.0578 -0.1499 -0.2490 -0.2708 -0.1734 0.3463 -0.0212 0.3273 0.5089 0.0419 -0.2614 -0.1497 -0.1802 0.2342 -0.0758 -0.2163 0.2416 -0.1761 -0.1705 -0.0906 -0.1118 -0.1564 0.1220 0.1027 0.0841 0.0886 0.1059 0.0860 0.0962 0.0966 0.1374 0.1076 0.0839 0.1110 0.1260 0.1274 0.1229 0.1354 0.1253 0.1323 0.1279
va: 1.3129 1.1385 1.1356 1.1455 2.1452 2.1367 2.1209 3.1159 3.7231 3.8816 3.8860 3.9011 3.9128 3.8460 4.2011 3.9906 3.8763 4.4620 3.7397 3.9723 3.9530 4.0051 3.8713 3.9636 4.0399 3.7850 4.0372 3.9645 3.8817 3.8947 3.9191 1.0225 1.0255 1.0019 1.0027 1.0222 1.0016 1.0067 1.0010 1.0110 1.0176 1.0553 1.0127 1.0000 1.0134 1.0118 1.0029 1.0047 0.9990 1.0036
dispcorr: -0.029590142 hartree
energy: -1928.188634865902
dipole: -20.18760 20.27360 0.08600 -13.41650 12.72668 -0.68982 11.25879 -9.56200 1.69679
magnitude: 1.83367 au
magnitude: 4.66082 debye
