program: Orca
programVersion: 5.0.2
elementType: Cl F F F O O O N C C C C C C C C C C C C C C C C C C C C C C C H H H H H H H H H H H H H H H H H H H
charge: 0
multiplicity: 1
keywords: wb97x-d3
keywords: def2-TZVPP
keywords: def2/J RIJCOSX
keywords: DEFGRID2
keywords: scfconv7
keywords: smallprint printgap noloewdin
keywords: NOSOSCF
formula: C23H19ClF3NO3
InChI: InChI=1/C23H19ClF3NO3/c1-22(2)17(12-19(24)23(25,26)27)20(22)21(29)31-18(13-28)14-7-6-10-16(11-14)30-15-8-4-3-5-9-15/h3-12,17-18,20H,1-2H3
50 atoms
Cl 1.957839 -5.665181 -1.053616
F  4.918244 -5.92465 -0.980638
F  5.375456 -3.883883 -1.492931
F  4.340651 -5.148053 -2.898717
O  -0.337237 0.136223 -1.225239
O  -1.150903 -1.758082 -0.353253
O  -1.927279 4.352017 1.474253
N  -1.452616 2.14025 -3.609433
C  1.60579 -1.735452 1.143631
C  1.641052 -2.721147 0.009829
C  1.196457 -1.29313 -0.243914
C  0.575626 -1.956794 2.224753
C  2.891403 -1.143405 1.670679
C  2.901725 -3.189477 -0.568263
C  -0.217942 -1.041762 -0.591474
C  3.136925 -4.410975 -1.032989
C  -1.660933 0.56043 -1.53956
C  4.453445 -4.843043 -1.605351
C  -2.302964 1.25761 -0.365762
C  -1.528616 1.448121 -2.696282
C  -1.857269 2.51526 0.021506
C  -3.317075 0.626285 0.339226
C  -2.431835 3.141265 1.116215
C  -3.885177 1.262725 1.432886
C  -3.449678 2.515075 1.829565
C  -2.768238 5.322791 1.944483
C  -3.967883 5.618729 1.309687
C  -2.357518 6.047787 3.052767
C  -4.758428 6.645877 1.799928
C  -3.154674 7.07865 3.527235
C  -4.359192 7.378172 2.908996
H  0.832772 -3.443095 0.013946
H  1.901773 -0.641898 -0.747553
H  0.281139 -1.008963 2.678372
H  -0.32263 -2.450222 1.86385
H  1.005436 -2.580298 3.010026
H  2.679833 -0.228053 2.224552
H  3.384386 -1.838793 2.351576
H  3.6023 -0.884552 0.886774
H  3.72062 -2.483166 -0.619273
H  -2.274625 -0.293408 -1.842896
H  -1.074673 3.025335 -0.527566
H  -3.654071 -0.358563 0.04568
H  -4.673502 0.774124 1.989393
H  -3.897328 3.000773 2.686908
H  -4.279571 5.059981 0.436424
H  -1.417337 5.806637 3.531026
H  -5.69171 6.878068 1.304332
H  -2.831438 7.645578 4.390185
H  -4.979875 8.180259 3.284257
totalener: -1928.16598138 hartree
nucrepener: 3010.55336204 hartree
electener: -4938.71934342 hartree
oneelecener: -8627.82580896 hartree
twoeener: 3689.10646554 hartree
kineticenergy: 1921.68283592 hartree
xcener: -157.120817190456 hartree
chargesum: 0.0000000
charge: -0.047476 -0.159546 -0.170266 -0.158700 -0.260444 -0.379095 -0.297898 0.000610 0.060429 0.026047 -0.086531 -0.248255 -0.250464 -0.150109 0.360368 -0.074769 0.333429 0.505655 -0.003445 -0.268815 -0.183586 -0.121668 0.171480 -0.114356 -0.137362 0.214394 -0.140478 -0.195213 -0.122680 -0.099165 -0.136020 0.089943 0.085869 0.091305 0.102356 0.092517 0.096937 0.102489 0.076868 0.115773 0.123335 0.122849 0.119622 0.131541 0.135861 0.136278 0.126147 0.129773 0.126649 0.127817
qa: -0.0475 -0.1595 -0.1703 -0.1587 -0.2604 -0.3791 -0.2979 0.0006 0.0604 0.0260 -0.0865 -0.2483 -0.2505 -0.1501 0.3604 -0.0748 0.3334 0.5057 -0.0034 -0.2688 -0.1836 -0.1217 0.1715 -0.1144 -0.1374 0.2144 -0.1405 -0.1952 -0.1227 -0.0992 -0.1360 0.0899 0.0859 0.0913 0.1024 0.0925 0.0969 0.1025 0.0769 0.1158 0.1233 0.1228 0.1196 0.1315 0.1359 0.1363 0.1261 0.1298 0.1266 0.1278
va: 1.2885 1.1470 1.1325 1.1465 2.1378 2.1250 2.1022 3.1166 3.7790 3.8103 3.8742 3.9155 3.9101 3.8943 4.2337 4.0692 3.8100 4.4816 3.6726 4.0288 4.0896 3.9757 3.9183 3.9603 3.9363 3.8216 3.9327 4.0292 3.9509 3.9435 3.9542 1.0518 1.0348 1.0017 1.0208 1.0013 1.0041 1.0014 1.0107 1.0300 1.0167 1.0277 1.0204 1.0007 1.0025 1.0022 1.0128 0.9996 0.9988 0.9998
dispcorr: -0.023927733 hartree
energy: -1928.189909109771
dipole: -31.95311 31.25054 -0.70256 45.33123 -44.65288 0.67835 30.93108 -28.81259 2.11848
magnitude: 2.33275 au
magnitude: 5.92938 debye
