program: Orca
programVersion: 5.0.2
elementType: Cl F F F O O O N C C C C C C C C C C C C C C C C C C C C C C C H H H H H H H H H H H H H H H H H H H
charge: 0
multiplicity: 1
keywords: wb97x-d3
keywords: def2-TZVPP
keywords: def2/J RIJCOSX
keywords: DEFGRID2
keywords: scfconv7
keywords: smallprint printgap noloewdin
keywords: NOSOSCF
formula: C23H19ClF3NO3
InChI: InChI=1/C23H19ClF3NO3/c1-22(2)17(12-19(24)23(25,26)27)20(22)21(29)31-18(13-28)14-7-6-10-16(11-14)30-15-8-4-3-5-9-15/h3-12,17-18,20H,1-2H3
50 atoms
Cl 3.727885 -3.916694 1.49907
F  4.108348 -5.100961 -2.176732
F  3.662365 -6.262055 -0.418583
F  5.517467 -5.189777 -0.550872
O  -1.171245 -0.788452 -1.010204
O  -0.068447 -0.508393 0.917806
O  -2.193912 3.923483 1.873949
N  -4.332503 -1.521375 -1.664823
C  2.421734 -0.447616 -0.986111
C  2.30359 -1.796656 -0.334522
C  1.108394 -1.196334 -1.05115
C  2.590565 0.751956 -0.085922
C  3.170236 -0.309964 -2.291264
C  2.944935 -2.984653 -0.901738
C  -0.065224 -0.793177 -0.247878
C  3.572582 -3.932478 -0.215299
C  -2.376706 -0.355791 -0.384037
C  4.218834 -5.129218 -0.846839
C  -2.499605 1.14716 -0.426572
C  -3.463036 -1.011056 -1.114833
C  -2.332999 1.875343 0.74161
C  -2.740866 1.798999 -1.629887
C  -2.409357 3.260721 0.706591
C  -2.808005 3.181803 -1.653541
C  -2.640703 3.92112 -0.49313
C  -2.956664 5.012048 2.191448
C  -4.321158 5.061573 1.933559
C  -2.323418 6.061233 2.841167
C  -5.044532 6.178482 2.321979
C  -3.06199 7.16709 3.23258
C  -4.422194 7.234906 2.970501
H  2.236165 -1.770967 0.746821
H  0.862389 -1.611987 -2.021791
H  3.653207 0.922452 0.092855
H  2.186698 1.648495 -0.559266
H  2.105882 0.634979 0.879413
H  2.885344 0.617548 -2.789396
H  4.245967 -0.275438 -2.112713
H  2.975935 -1.122068 -2.99071
H  2.908934 -3.103605 -1.977137
H  -2.416032 -0.703857 0.652594
H  -2.13142 1.377668 1.681461
H  -2.884296 1.234503 -2.542454
H  -2.992166 3.695404 -2.587458
H  -2.692099 5.001753 -0.523386
H  -4.819332 4.237246 1.439631
H  -1.261655 6.002579 3.041057
H  -6.106869 6.215828 2.120409
H  -2.566167 7.983225 3.741124
H  -4.993794 8.101598 3.272991
totalener: -1928.16594906 hartree
nucrepener: 3012.36389443 hartree
electener: -4940.52984349 hartree
oneelecener: -8631.41131277 hartree
twoeener: 3690.88146928 hartree
kineticenergy: 1921.68332216 hartree
xcener: -157.120983800984 hartree
chargesum: 0.0000000
charge: -0.047458 -0.170171 -0.158509 -0.159804 -0.257986 -0.380000 -0.296222 -0.000167 0.057724 0.035757 -0.099192 -0.247117 -0.243172 -0.152666 0.366574 -0.076908 0.312282 0.506532 0.000167 -0.256677 -0.141066 -0.165238 0.180277 -0.114064 -0.141952 0.237162 -0.154722 -0.208285 -0.121362 -0.092167 -0.141719 0.091300 0.084867 0.092015 0.089939 0.104187 0.096267 0.101939 0.074976 0.116260 0.121982 0.120439 0.123375 0.132432 0.137503 0.133797 0.126545 0.128972 0.126031 0.127323
qa: -0.0475 -0.1702 -0.1585 -0.1598 -0.2580 -0.3800 -0.2962 -0.0002 0.0577 0.0358 -0.0992 -0.2471 -0.2432 -0.1527 0.3666 -0.0769 0.3123 0.5065 0.0002 -0.2567 -0.1411 -0.1652 0.1803 -0.1141 -0.1420 0.2372 -0.1547 -0.2083 -0.1214 -0.0922 -0.1417 0.0913 0.0849 0.0920 0.0899 0.1042 0.0963 0.1019 0.0750 0.1163 0.1220 0.1204 0.1234 0.1324 0.1375 0.1338 0.1265 0.1290 0.1260 0.1273
va: 1.2882 1.1325 1.1480 1.1457 2.1393 2.1232 2.1081 3.1170 3.7782 3.8016 3.8900 3.9154 3.9090 3.8882 4.2274 4.0675 3.8307 4.4818 3.6594 4.0212 4.0267 4.0347 3.9236 3.9532 3.9534 3.8033 3.9269 4.0335 3.9530 3.9392 3.9594 1.0513 1.0354 1.0011 1.0018 1.0207 1.0042 1.0019 1.0108 1.0288 1.0179 1.0323 1.0156 1.0005 1.0013 1.0035 1.0134 0.9997 0.9988 0.9999
dispcorr: -0.023838613 hartree
energy: -1928.189787669151
dipole: -25.84064 26.19799 0.35735 56.57437 -54.35580 2.21857 -1.00181 0.69297 -0.30883
magnitude: 2.26829 au
magnitude: 5.76553 debye
