program: Orca
programVersion: 5.0.2
elementType: Cl F F F O O O N C C C C C C C C C C C C C C C C C C C C C C C H H H H H H H H H H H H H H H H H H H
charge: 0
multiplicity: 1
keywords: wb97x-d3
keywords: def2-TZVPP
keywords: def2/J RIJCOSX
keywords: DEFGRID2
keywords: scfconv7
keywords: smallprint printgap noloewdin
keywords: NOSOSCF
formula: C23H19ClF3NO3
InChI: InChI=1/C23H19ClF3NO3/c1-22(2)17(12-19(24)23(25,26)27)20(22)21(29)31-18(13-28)14-7-6-10-16(11-14)30-15-8-4-3-5-9-15/h3-12,17-18,20H,1-2H3
50 atoms
Cl 1.82377 -0.226848 -2.302107
F  4.817175 -0.676848 -1.809819
F  4.645378 -0.588064 0.336726
F  4.066299 1.100679 -0.866706
O  -2.030998 -1.62156 0.474085
O  -1.672122 -1.398613 2.6766
O  -1.170605 3.41741 -0.205124
N  -5.112311 -2.579095 -0.289143
C  0.405239 -3.473845 0.464946
C  0.754067 -2.085876 0.001146
C  0.054434 -2.292717 1.33632
C  -0.649258 -4.230587 -0.307466
C  1.492894 -4.379903 0.996294
C  2.120657 -1.565478 0.017209
C  -1.29435 -1.740491 1.592012
C  2.6614 -0.766643 -0.895947
C  -3.272697 -0.924588 0.546276
C  4.058531 -0.232524 -0.809602
C  -3.156693 0.335711 -0.278332
C  -4.304834 -1.846483 0.072045
C  -2.253488 1.293492 0.17661
C  -3.861831 0.534803 -1.451705
C  -2.036543 2.440937 -0.569282
C  -3.655939 1.704322 -2.175114
C  -2.745915 2.650538 -1.749965
C  -0.25087 3.173139 0.783037
C  -0.373084 3.856323 1.981429
C  0.802133 2.295496 0.564448
C  0.576388 3.661667 2.974564
C  1.739127 2.104009 1.567872
C  1.629373 2.783048 2.773062
H  0.125389 -1.703031 -0.79332
H  0.676046 -2.184544 2.217947
H  -1.376642 -3.587896 -0.794572
H  -0.169461 -4.830089 -1.082337
H  -1.190296 -4.913292 0.349544
H  1.054358 -5.180839 1.592505
H  2.041962 -4.839718 0.1734
H  2.213391 -3.866128 1.63165
H  2.746217 -1.837712 0.857931
H  -3.499265 -0.674751 1.587575
H  -1.726121 1.143788 1.111017
H  -4.565501 -0.204374 -1.810589
H  -4.206701 1.869882 -3.091177
H  -2.574917 3.554142 -2.319969
H  -1.199104 4.539741 2.127666
H  0.89252 1.778854 -0.382647
H  0.487759 4.198014 3.909741
H  2.566243 1.427974 1.403716
H  2.367967 2.632006 3.548548
totalener: -1928.16219326 hartree
nucrepener: 3345.13100236 hartree
electener: -5273.29319562 hartree
oneelecener: -9296.53985690 hartree
twoeener: 4023.24666128 hartree
kineticenergy: 1921.68667047 hartree
xcener: -157.123593604016 hartree
chargesum: 0.0000000
charge: -0.053274 -0.156459 -0.175491 -0.159358 -0.263696 -0.339789 -0.292244 0.002980 0.048565 0.088888 -0.079146 -0.238767 -0.245555 -0.180403 0.329928 -0.106498 0.320498 0.531319 -0.025238 -0.288586 -0.182649 -0.175579 0.237628 -0.069665 -0.210869 0.211763 -0.165276 -0.160724 -0.107867 -0.103456 -0.136536 0.087432 0.085881 0.095178 0.090324 0.097847 0.099720 0.100945 0.074298 0.117741 0.140070 0.141126 0.126164 0.129721 0.127640 0.125961 0.137998 0.127387 0.113961 0.126163
qa: -0.0533 -0.1565 -0.1755 -0.1594 -0.2637 -0.3398 -0.2922 0.0030 0.0486 0.0889 -0.0791 -0.2388 -0.2456 -0.1804 0.3299 -0.1065 0.3205 0.5313 -0.0252 -0.2886 -0.1826 -0.1756 0.2376 -0.0697 -0.2109 0.2118 -0.1653 -0.1607 -0.1079 -0.1035 -0.1365 0.0874 0.0859 0.0952 0.0903 0.0978 0.0997 0.1009 0.0743 0.1177 0.1401 0.1411 0.1262 0.1297 0.1276 0.1260 0.1380 0.1274 0.1140 0.1262
va: 1.2783 1.1535 1.1260 1.1427 2.0841 2.1647 2.1265 3.1173 3.8144 3.6939 3.8386 3.9143 3.9157 3.8629 4.2831 4.0420 3.8050 4.4461 3.8461 4.0479 3.8740 3.9943 3.8521 3.9587 4.0481 3.8763 4.0191 3.9505 3.9430 3.9164 4.0097 1.0487 1.0320 1.0176 1.0019 1.0026 1.0035 1.0017 1.0109 1.0304 1.0244 1.0227 1.0224 0.9992 1.0131 1.0110 1.0159 0.9990 1.0247 1.0014
dispcorr: -0.029713904 hartree
energy: -1928.191907161893
dipole: -20.94092 21.70809 0.76717 -11.01345 10.89469 -0.11876 14.33096 -14.04252 0.28844
magnitude: 0.82816 au
magnitude: 2.10501 debye
