program: Orca
programVersion: 5.0.2
elementType: Cl F F F O O O N C C C C C C C C C C C C C C C C C C C C C C C H H H H H H H H H H H H H H H H H H H
charge: 0
multiplicity: 1
keywords: wb97x-d3
keywords: def2-TZVPP
keywords: def2/J RIJCOSX
keywords: DEFGRID2
keywords: scfconv7
keywords: smallprint printgap noloewdin
keywords: NOSOSCF
formula: C23H19ClF3NO3
InChI: InChI=1/C23H19ClF3NO3/c1-22(2)17(12-19(24)23(25,26)27)20(22)21(29)31-18(13-28)14-7-6-10-16(11-14)30-15-8-4-3-5-9-15/h3-12,17-18,20H,1-2H3
50 atoms
Cl 4.019763 -3.830141 1.303529
F  3.808702 -5.240942 -2.305804
F  3.824502 -6.273261 -0.417143
F  5.524715 -5.104103 -1.011543
O  -1.281844 -0.963407 -0.743489
O  -0.008764 -0.516751 1.04457
O  -2.935818 3.787428 1.915524
N  -4.367625 -2.126499 -0.943746
C  2.29827 -0.508847 -1.075478
C  2.262251 -1.844233 -0.386423
C  0.995639 -1.27154 -0.996628
C  2.536739 0.712932 -0.221877
C  2.913623 -0.39188 -2.450514
C  2.851231 -3.042998 -0.989599
C  -0.107304 -0.869357 -0.097917
C  3.601406 -3.942012 -0.362862
C  -2.453513 -0.6100 -0.014154
C  4.191538 -5.149068 -1.030696
C  -2.783563 0.852781 -0.176038
C  -3.520242 -1.461731 -0.545196
C  -2.69407 1.694699 0.918442
C  -3.157033 1.351483 -1.420204
C  -3.003207 3.045017 0.781892
C  -3.451891 2.696065 -1.546002
C  -3.383718 3.550897 -0.4539
C  -2.944717 5.154907 1.836386
C  -4.019496 5.840684 2.37792
C  -1.876319 5.83779 1.271341
C  -4.020426 7.228349 2.359201
C  -1.8927 7.223481 1.250555
C  -2.962576 7.922404 1.792576
H  2.304774 -1.793535 0.695427
H  0.666332 -1.717427 -1.928423
H  2.063908 1.590331 -0.666534
H  2.161417 0.607882 0.7923
H  3.608372 0.908749 -0.162855
H  4.000004 -0.323897 -2.378719
H  2.677007 -1.231146 -3.103262
H  2.554341 0.511654 -2.944755
H  2.657337 -3.216268 -2.040654
H  -2.33035 -0.848389 1.046554
H  -2.387167 1.316311 1.885499
H  -3.233119 0.694842 -2.27742
H  -3.754299 3.092792 -2.505839
H  -3.63636 4.595905 -0.572778
H  -4.840766 5.28949 2.816739
H  -1.038717 5.289447 0.859165
H  -4.856133 7.766586 2.786339
H  -1.060522 7.759507 0.813862
H  -2.968079 9.003863 1.777597
totalener: -1928.16578611 hartree
nucrepener: 3005.90909276 hartree
electener: -4934.07487887 hartree
oneelecener: -8618.51301213 hartree
twoeener: 3684.43813326 hartree
kineticenergy: 1921.67068756 hartree
xcener: -157.117754622270 hartree
chargesum: 0.0000000
charge: -0.047798 -0.169718 -0.158288 -0.160066 -0.260589 -0.377830 -0.291509 -0.000835 0.062241 0.031060 -0.102479 -0.247649 -0.239827 -0.150079 0.361454 -0.078203 0.312915 0.506701 0.006304 -0.254872 -0.153076 -0.176925 0.222283 -0.128298 -0.151195 0.204995 -0.167140 -0.155792 -0.111506 -0.119229 -0.124427 0.091848 0.083744 0.088308 0.104879 0.091555 0.101271 0.074194 0.096159 0.116754 0.118979 0.116344 0.123259 0.130457 0.133154 0.128075 0.133177 0.128949 0.128980 0.129285
qa: -0.0478 -0.1697 -0.1583 -0.1601 -0.2606 -0.3778 -0.2915 -0.0008 0.0622 0.0311 -0.1025 -0.2476 -0.2398 -0.1501 0.3615 -0.0782 0.3129 0.5067 0.0063 -0.2549 -0.1531 -0.1769 0.2223 -0.1283 -0.1512 0.2050 -0.1671 -0.1558 -0.1115 -0.1192 -0.1244 0.0918 0.0837 0.0883 0.1049 0.0916 0.1013 0.0742 0.0962 0.1168 0.1190 0.1163 0.1233 0.1305 0.1332 0.1281 0.1332 0.1289 0.1290 0.1293
va: 1.2875 1.1334 1.1497 1.1440 2.1362 2.1254 2.1131 3.1163 3.7727 3.8081 3.8923 3.9158 3.9101 3.8839 4.2309 4.0643 3.8355 4.4819 3.6893 4.0230 4.0445 4.0379 3.9024 3.9846 3.9275 3.8327 4.0267 3.9784 3.9407 3.9411 3.9450 1.0499 1.0367 1.0018 1.0209 1.0012 1.0025 1.0107 1.0040 1.0278 1.0218 1.0300 1.0155 1.0013 1.0074 1.0108 1.0032 0.9991 0.9995 0.9995
dispcorr: -0.023626726 hartree
energy: -1928.189412838578
dipole: -24.88840 25.29432 0.40592 57.31031 -54.74832 2.56198 -3.12177 2.60572 -0.51605
magnitude: 2.64478 au
magnitude: 6.72248 debye
